program: Gaussian 09
title: 000281682
version: EM64L-G09RevD.01
frameworkgroup: C1[X(C20H22O8)]
method: RPBEPBE
basis: SDD
operation: Freq
keyword: #pfreq=noraman
keyword: PBEPBE/SDD
title: #p freq=noraman PBEPBE/SDD
converged: YES YES NO NO
title: Mulliken charges:
elementType: O O O O O O O O C C C C C C C C C C C C C C C C C C C C H H H H H H H H H H H H H H H H H H H H H H
charge: -0.285424 -0.307278 -0.303758 -0.262975 -0.418066 -0.437262 -0.230341 -0.245123 0.504434 -0.032900 -0.608274 0.287636 0.164847 -0.639733 0.022110 0.263245 -0.503295 0.128238 -0.375162 -0.475061 -0.385034 0.343654 0.182001 0.066387 -0.533287 -0.525967 -0.527333 -0.536816 0.240449 0.244759 0.264353 0.271604 0.272496 0.249370 0.298723 0.247225 0.221287 0.255593 0.244571 0.229342 0.225407 0.249999 0.223363 0.225444 0.255339 0.374935 0.382758 0.222340 0.222545 0.248635
chargesum: 0.00000
title: Mulliken charges with hydrogens summed into heavy atoms:
elementType: O O O O O O O O C C C C C C C C C C C C C C C C C C C C
charge: -0.285424 -0.307278 -0.303758 -0.262975 -0.043130 -0.054504 -0.230341 -0.245123 0.504434 -0.032900 -0.123066 0.287636 0.164847 -0.375380 0.022110 0.263245 0.040804 0.128238 -0.125792 -0.176338 -0.137809 0.343654 0.182001 0.066387 0.188164 0.178782 0.176812 0.156705
polarizability: 3.30295189e+02 7.61020513e+00 2.24991824e+02 1.25004949e+01 9.30549154e-01 2.08374672e+02
1716.lowfreq: -6.4284 -1.6043 -0.0002 0.0002 0.0005 3.5647 16.3330 21.0443 23.3433
frequency: 16.2207 21.0238 23.2957 27.5122 37.7956 40.2836 52.4024 61.1271 79.1442 83.5510 87.2317 94.2935 106.1852 116.9239 125.2919 142.4817 151.1231 164.9728 171.8845 174.7493 178.4483 195.8902 207.6775 218.5606 238.9841 248.1088 261.2407 285.4487 291.7840 308.8390 346.5473 362.6399 382.3183 391.7507 412.6667 427.8277 430.9446 478.2361 500.7845 507.4456 511.9282 536.9726 544.3230 561.6127 591.7654 600.5565 606.7862 618.7364 638.8590 640.4840 673.2949 699.4751 708.6522 713.2348 760.7061 779.9017 796.4499 797.6279 829.4101 861.6771 863.1862 875.3084 887.0349 915.7020 917.7491 950.4879 955.5537 993.5177 998.9484 1005.3837 1011.1839 1028.6448 1053.9536 1075.3540 1097.5172 1110.9035 1112.2102 1112.9240 1114.0416 1122.8790 1140.0149 1151.1651 1153.6065 1155.9410 1159.3095 1171.0221 1198.0825 1218.2010 1238.5836 1245.5348 1266.5146 1271.4070 1298.5418 1305.4814 1318.3859 1350.5121 1363.5224 1365.0064 1381.4129 1410.1101 1417.9923 1431.5484 1436.4586 1439.5985 1439.8313 1453.9958 1457.6616 1459.7176 1461.9118 1467.7199 1471.9905 1475.5268 1476.3489 1484.9926 1488.1388 1498.8696 1559.2463 1564.3372 1599.6855 1615.0573 1642.4351 1667.5296 2960.2729 2972.3022 2973.8891 2986.6895 2996.1127 3014.9640 3048.5477 3051.6498 3071.1977 3073.4192 3077.0796 3093.3157 3116.6280 3120.7729 3122.6637 3128.0894 3137.0256 3146.2607 3165.5566 3190.0038 3508.6208 3526.9708
redmass: 6.8550 12.9722 5.5439 4.7123 6.7745 4.4385 6.2348 3.9498 3.7515 2.3482 3.2564 2.9977 2.7534 4.3747 3.4344 3.8003 3.0230 1.4504 1.0792 1.5856 2.5069 3.2512 4.0715 4.2172 1.3336 4.3972 4.7453 4.8953 3.2324 5.6768 7.6498 5.6567 5.2404 5.4587 5.3333 5.0592 3.6421 6.3488 2.6090 3.1368 3.8204 3.8675 5.6593 4.0182 4.4473 1.6098 2.6738 4.9482 2.6945 1.6889 5.2013 6.0919 6.6002 5.7186 5.5800 1.5258 5.7312 3.2671 1.6724 6.6510 3.3129 4.1049 2.5897 4.0739 1.6617 4.6586 1.6059 5.5099 3.1664 3.2272 4.3481 3.9597 4.0481 2.4598 3.4264 1.2419 1.2598 1.2386 1.2404 1.8988 1.4370 1.3513 1.2656 1.4127 1.4248 1.3298 1.7255 2.4634 1.4344 3.1018 1.4253 1.4465 1.5905 2.5196 4.7151 6.9614 1.8162 6.8602 2.6649 3.4094 1.3431 1.3288 1.2295 1.3269 1.1153 1.9379 1.0591 1.0684 1.2762 1.0500 1.0672 1.0544 1.0924 1.0536 1.0633 3.4570 8.2581 7.9220 7.9242 7.1167 8.3749 8.2072 1.0331 1.0298 1.0308 1.0291 1.0630 1.0608 1.1041 1.0957 1.1049 1.1036 1.1022 1.1043 1.1028 1.1033 1.1045 1.0992 1.0889 1.0917 1.0948 1.0920 1.0639 1.0641
irintensity: 0.0479 1.0176 0.3134 0.3344 0.4549 2.4555 0.2308 4.7612 0.3176 1.9080 3.2967 4.6925 9.2572 0.6742 2.3008 0.5424 4.2012 2.0429 0.0858 0.1668 0.3067 1.5346 4.1082 6.5302 0.8184 10.7504 11.3069 3.2595 1.6133 3.0532 2.5565 3.9020 2.7470 2.5373 16.7352 4.6355 5.4388 7.9324 20.3591 37.1052 7.9895 30.4902 25.9418 8.5220 6.1278 95.8942 47.3337 15.9875 30.6351 87.8564 5.8933 3.9888 7.4628 9.6699 9.5220 15.4792 6.8982 3.8057 32.7351 4.7381 14.6103 11.2588 4.6232 66.9494 22.0157 83.8745 12.0807 231.0313 57.4156 32.1488 49.6317 230.5529 117.6244 104.8374 119.9620 3.8423 0.2230 9.1231 10.2180 36.4646 22.7636 1.6574 3.0241 2.9217 16.2584 14.7887 42.9667 179.4925 5.0710 55.1837 23.9440 45.0002 55.4530 76.8549 53.4617 3.6236 74.1492 5.5535 74.4937 21.4994 8.4977 38.6004 19.2796 8.4887 38.2174 118.3189 7.2005 9.4735 31.6040 14.0669 39.1518 6.3197 12.4265 27.8697 13.0265 28.4635 82.8847 37.2280 45.2501 136.7765 172.8102 207.5087 66.7638 78.9792 66.4029 64.5545 8.6478 12.5601 44.7256 1.3237 26.1356 23.3358 19.6885 21.2216 27.7522 28.8021 15.3654 27.3486 8.8193 4.3893 11.0760 2.8297 17.4421 42.6714
temp: 298.150 k
press: 1.00000 atm
elementType: 8 8 8 8 8 8 8 8 6 6 6 6 6 6 6 6 6 6 6 6 6 6 6 6 6 6 6 6 1 1 1 1 1 1 1 1 1 1 1 1 1 1 1 1 1 1 1 1 1 1
symmnumber: 1
zpe: 1009549.9 jmol-1
zpe.correction: 0.384517 hartree
zpe.thermalcorrener: 0.414213 hartree
zpe.thermalcorrenthalpy: 0.415157 hartree
zpe.thermalcorrgfe: 0.320110 hartree
zpe.sumelectzpe: -1374.994903 hartree
zpe.sumelectthermal: -1374.965207 hartree
zpe.sumelectthermalent: -1374.964263 hartree
zpe.sumelectthermalfe: -1375.059311 hartree
dipole: -0.8368 -0.9801 -2.7577
dipole: 3.0439
quadrupole: -137.1214 -159.9422 -152.6109
quadrupole: -3.1472 13.1167 -6.5329
quadrupole: 12.7701 -10.0507 -2.7194 -3.1472 13.1167 -6.5329
hfenergy: -1375.3794204 hartree
pointgroup: C01 [X(C20H22O8)]
dipole: 0.3138845 0.4197861 -1.0767685 debye
polarizability: 329.8291493|9.3769584|225.2667155|-13.3671446|-0.7230806|208.5658199 unknown
InChI: InChI=1S/C20H22O8/c1-25-12-6-7-13(14(10-12)20(23)24)17-11(5-8-16(21)22)9-15(26-2)18(27-3)19(17)28-4/h6-7,9-10,21,23H,5,8H2,1-4H3
charge 0 multiplicity 1
50 atoms
O  -1.309314 2.211067 -0.894559
O  -4.024628 1.289309 -0.849665
O  -4.535666 -1.409461 0.055346
O  4.886763 1.941973 -0.461359
O  2.310725 -4.775897 -1.168335
O  1.720403 1.920735 3.236799
O  2.05445 -4.510684 1.123259
O  -0.416321 1.627026 2.399741
C  -0.818182 -1.25656 0.357333
C  -0.552633 0.080684 -0.051994
C  0.2977 -2.214789 0.7555
C  0.850651 0.610822 -0.144773
C  -1.633111 0.924571 -0.431406
C  -2.158281 -1.712792 0.408864
C  -2.968861 0.445039 -0.419668
C  -3.225957 -0.875757 0.037027
C  0.761531 -3.081355 -0.440451
C  1.526771 1.283194 0.923959
C  1.572318 0.406865 -1.343758
C  2.871669 1.697873 0.778181
C  2.908567 0.832301 -1.508316
C  3.564553 1.478016 -0.432249
C  1.74743 -4.158968 -0.036538
C  0.822081 1.602096 2.198826
C  -1.972909 3.344981 -0.204328
C  -4.587788 0.892463 -2.162798
C  -5.481684 -0.711368 0.957909
C  5.647016 1.741094 -1.697965
H  1.168479 -1.667043 1.156097
H  -0.049156 -2.886575 1.560932
H  -2.391926 -2.72509 0.755149
H  -0.105981 -3.580446 -0.915993
H  1.223956 -2.461077 -1.229251
H  1.062924 -0.082854 -2.180937
H  3.38365 2.199448 1.602142
H  3.414785 0.658687 -2.462468
H  -1.510975 4.246152 -0.636413
H  -3.05913 3.33029 -0.392287
H  -1.768274 3.288586 0.880035
H  -3.809586 0.960206 -2.945559
H  -5.394822 1.612413 -2.369484
H  -4.991886 -0.135137 -2.113458
H  -5.14648 -0.812304 2.007646
H  -6.446451 -1.223534 0.821106
H  -5.565182 0.356542 0.689889
H  2.93376 -5.493082 -0.868801
H  1.189894 2.147296 4.047483
H  5.750558 0.664658 -1.936786
H  5.17595 2.268227 -2.550426
H  6.638201 2.172858 -1.497399
