program: Gaussian 09
title: 000281618
version: EM64L-G09RevD.01
frameworkgroup: C1[X(C14H24N4O7)]
method: RPBEPBE
basis: SDD
operation: Freq
keyword: #p
keyword: freq=noraman
keyword: PBEPBE/SDD
title: #p freq=noraman PBEPBE/SDD
converged: YES YES NO NO
title: Mulliken charges:
elementType: O O O O O O O N N N N C C C C C C C C C C C C C C H H H H H H H H H H H H H H H H H H H H H H H H
charge: -0.289421 -0.253791 -0.311003 -0.218704 -0.234769 -0.291870 -0.301317 -0.180116 -0.368925 -0.352649 -0.624361 -0.202246 -0.147442 -0.238842 -0.427450 0.220451 0.232527 0.315525 -0.262036 -0.262184 0.235865 -0.250857 -0.663407 -0.657652 -0.663498 0.297402 0.269995 0.342951 0.248731 0.254044 0.289975 0.330045 0.242456 0.219542 0.226901 0.228339 0.216035 0.235596 0.215791 0.239753 0.263033 0.214891 0.235274 0.252836 0.255910 0.223640 0.212695 0.333292 0.349048
chargesum: 0.00000
title: Mulliken charges with hydrogens summed into heavy atoms:
elementType: O O O O O O O N N N N C C C C C C C C C C C C C C
charge: -0.289421 -0.253791 -0.311003 -0.218704 -0.234769 -0.291870 -0.301317 -0.180116 -0.078950 -0.022605 0.057980 0.095155 0.122552 0.104109 0.075325 0.220451 0.232527 0.315525 0.199962 0.193056 0.235865 0.200774 0.055170 0.045349 0.028746
polarizability: 2.43405472e+02 -5.24582746e+00 1.91990699e+02 7.44005246e+00 -4.15774353e+00 1.71366117e+02
1716.lowfreq: -7.9028 -2.1478 -0.0010 -0.0009 -0.0006 5.4947 10.9919 16.1035 25.2935
frequency: 10.3184 16.0286 25.2593 35.6765 38.4159 43.5611 46.7434 54.7433 62.0820 65.2294 79.6915 89.3658 91.2703 100.4786 109.9949 120.6630 134.1368 156.4831 196.9113 200.0106 209.7266 220.6403 239.4918 264.5323 270.6517 294.4984 306.5026 318.5486 331.2347 337.1390 375.2276 411.4463 424.3129 431.3453 439.7201 473.4164 494.4328 504.0742 533.2927 553.4951 575.5877 595.7147 622.7961 640.4837 673.2204 680.9154 700.5289 708.2033 716.9142 730.6597 774.5663 795.2152 802.7922 812.2364 814.9348 820.9139 823.5034 876.7624 893.8227 914.8751 929.4546 947.3109 993.8925 1005.4260 1012.5479 1017.0869 1042.6457 1050.0234 1061.0371 1089.4574 1096.5525 1097.0326 1097.8112 1115.9272 1141.0935 1144.9713 1155.1288 1156.3979 1158.0681 1158.1808 1199.2648 1208.1403 1230.9113 1247.0639 1273.4302 1274.6180 1276.4945 1281.7773 1302.8080 1324.9912 1330.7643 1343.7424 1350.4343 1352.7110 1357.6508 1389.3102 1391.6865 1393.5552 1396.3392 1399.3533 1426.4345 1457.5912 1458.8737 1461.3874 1462.8214 1463.0374 1465.2849 1470.7667 1480.6063 1484.0763 1484.9342 1487.7774 1549.5903 1635.0281 1641.8254 1649.2781 1664.6154 2963.3591 2980.0279 2990.9848 2991.6069 2995.1398 3012.5432 3027.8905 3028.1931 3033.4617 3060.3026 3086.0790 3088.3333 3090.8616 3091.3942 3092.3435 3093.5856 3095.8763 3117.4185 3118.5926 3121.6805 3388.3328 3471.3090 3516.6341 3698.5350
redmass: 5.6935 4.6643 4.3095 4.3985 4.6225 3.0111 4.7073 4.4717 3.1420 5.9735 4.5073 4.4719 4.3672 5.1481 3.5519 5.1457 4.8227 2.8255 1.5480 2.0773 2.1691 1.5891 2.1031 3.6101 2.2977 2.8959 2.8892 3.4291 4.7111 5.5162 4.8927 4.1823 3.2466 3.4146 3.2872 3.8978 2.1466 1.7158 1.8410 2.6809 3.5547 2.8347 1.6389 2.3881 4.6865 4.7554 9.5209 7.9984 4.0787 4.2799 2.6116 1.8604 1.7687 1.6533 1.6604 2.2203 1.7397 3.0483 3.7140 3.1947 4.4514 3.6360 2.5906 2.7566 2.8685 2.4155 2.7380 1.8710 4.4796 2.8976 2.2228 2.1701 2.1749 3.1544 4.1247 3.5839 1.6913 3.1262 1.7594 1.6948 1.3081 1.6629 1.3777 3.6301 1.1402 1.1671 1.2110 1.1170 1.3897 1.4547 1.5378 1.3869 1.3102 1.3306 1.3630 1.3853 1.9825 1.2354 2.5561 1.2489 1.3422 1.0968 1.0896 1.0964 1.0577 1.0479 1.0415 1.4443 1.0844 1.0528 1.0527 1.0527 1.2943 9.3949 10.2736 10.1135 4.7804 1.0849 1.0673 1.0360 1.0362 1.0364 1.0823 1.0592 1.0598 1.0589 1.0850 1.0978 1.0983 1.0975 1.1033 1.1031 1.0965 1.1031 1.1054 1.1074 1.1056 1.0759 1.0762 1.0468 1.1020
irintensity: 1.2453 1.2486 0.6204 4.6466 0.3715 0.0249 2.6687 0.8008 1.6635 0.1958 3.4253 1.4425 0.2554 1.0615 0.1030 0.4126 3.3265 1.5752 0.4984 3.0563 4.5058 2.5582 4.1545 0.2866 3.6417 19.0988 26.9133 7.6509 17.2289 6.9372 26.8848 8.7903 3.1847 3.1034 2.5156 25.7204 25.5604 93.2114 191.5097 142.4453 34.6616 20.0681 26.2559 30.2366 10.7167 2.8614 31.0262 49.2388 7.1179 10.7034 5.1722 5.5548 60.9199 18.3045 6.1785 1.5036 5.0172 44.6766 19.5866 26.0928 17.3908 8.0570 20.3020 133.2370 65.0805 59.8587 10.2897 0.4635 77.3747 223.6920 55.8579 4.3158 3.6277 42.0545 304.6759 201.2203 28.1616 17.1172 27.7033 2.6448 75.1448 14.8947 64.1624 13.3157 8.2391 5.2166 15.6089 5.8902 58.4334 107.4891 45.1904 25.0357 3.9983 13.7374 0.5867 104.2746 175.3355 23.4024 100.3262 28.7855 14.9853 43.4982 11.1637 12.6996 30.1893 6.7955 18.9954 36.4464 14.2437 8.0013 24.1096 16.8900 189.1819 148.0507 89.8214 430.2412 339.2368 30.1617 32.1531 15.8666 20.6528 18.4047 5.1712 52.2868 15.1956 31.8305 6.6100 38.0919 29.6732 30.1059 3.5035 0.8893 10.3680 0.9002 32.4285 22.5924 28.2000 2.9376 19.1069 27.6741 67.2605
temp: 298.150 k
press: 1.00000 atm
elementType: 8 8 8 8 8 8 8 7 7 7 7 6 6 6 6 6 6 6 6 6 6 6 6 6 6 1 1 1 1 1 1 1 1 1 1 1 1 1 1 1 1 1 1 1 1 1 1 1 1
symmnumber: 1
zpe: 1033447.6 jmol-1
zpe.correction: 0.393619 hartree
zpe.thermalcorrener: 0.421799 hartree
zpe.thermalcorrenthalpy: 0.422743 hartree
zpe.thermalcorrgfe: 0.329539 hartree
zpe.sumelectzpe: -1291.520808 hartree
zpe.sumelectthermal: -1291.492629 hartree
zpe.sumelectthermalent: -1291.491684 hartree
zpe.sumelectthermalfe: -1291.584888 hartree
dipole: 0.8811 -1.5079 1.9968
dipole: 2.6528
quadrupole: -158.9155 -121.2657 -152.2134
quadrupole: 2.0217 14.4274 -1.4406
quadrupole: -14.7840 22.8658 -8.0819 2.0217 14.4274 -1.4406
hfenergy: -1291.9144272 hartree
pointgroup: C01 [X(C14H24N4O7)]
dipole: 0.5558818 0.1634784 -0.8680735 debye
polarizability: 240.7878971|-14.548008|191.6177559|-2.0532942|-8.5201283|174.3566354 unknown
InChI: InChI=1S/C14H24N4O7/c1-4-23-11(19)9-8(16-17-13(15)21)7-18(14(22)25-6-3)10(9)12(20)24-5-2/h8-10,16-17H,4-7,15H2,1-3H3
charge 0 multiplicity 1
49 atoms
O  -2.164366 2.824132 0.12192
O  -0.804305 -1.83039 1.527167
O  3.796303 0.668716 -0.466207
O  -1.243557 2.045341 2.121023
O  0.725171 -2.212264 -0.198204
O  3.051597 -0.136698 1.625751
O  -4.594682 0.723193 -2.063413
N  1.552263 0.501073 -0.051989
N  -1.012614 0.86358 -2.525284
N  -2.378412 1.273707 -2.519679
N  -3.002226 -0.985993 -2.342733
C  -0.799365 0.85577 -0.010726
C  -0.220285 1.380528 -1.368785
C  0.360077 0.086343 0.690616
C  1.238333 0.853344 -1.447216
C  -1.385471 1.952205 0.883433
C  0.150756 -1.439007 0.600461
C  2.812637 0.295499 0.466865
C  -3.031238 3.79947 0.866498
C  -1.121704 -3.293812 1.600026
C  -3.40743 0.336657 -2.286474
C  5.204285 0.464281 -0.015094
C  -4.385059 3.152711 1.167961
C  -0.147053 -4.000194 2.544825
C  5.655692 -0.976442 -0.268804
H  -1.642278 0.172181 -0.22846
H  -0.220491 2.49035 -1.352263
H  0.431019 0.362197 1.756127
H  1.279654 -0.04451 -2.096573
H  1.955305 1.600184 -1.820386
H  -0.570744 1.110629 -3.424609
H  -2.612027 2.235289 -2.243994
H  -2.499896 4.106162 1.783971
H  -3.119826 4.65054 0.172392
H  -2.157129 -3.314018 1.975058
H  -1.073234 -3.713855 0.579679
H  5.77489 1.190467 -0.616684
H  5.271244 0.721562 1.056565
H  -5.071371 3.908407 1.59301
H  -4.276777 2.337007 1.902943
H  -4.838012 2.742886 0.248384
H  -0.437081 -5.061951 2.652608
H  -0.16161 -3.533562 3.544367
H  0.881514 -3.960774 2.149399
H  5.073096 -1.679549 0.349414
H  5.532174 -1.24731 -1.331718
H  6.7243 -1.085681 -0.004528
H  -3.709949 -1.708835 -2.254169
H  -2.024217 -1.204471 -2.536571
