program: Gaussian 09
title: 000281600
version: EM64L-G09RevD.01
frameworkgroup: C1[X(C13H23N5O3)]
method: RPBEPBE
basis: SDD
operation: Freq
keyword: #p
keyword: freq=noraman
keyword: PBEPBE/SDD
title: #p freq=noraman PBEPBE/SDD
converged: YES YES NO NO
title: Mulliken charges:
elementType: O O O N N N N N C C C C C C C C C C C C C H H H H H H H H H H H H H H H H H H H H H H H
charge: -0.264025 -0.414953 -0.241238 -0.368075 -0.458083 -0.044193 -0.618649 -0.681404 -0.020140 -0.561423 -0.356486 -0.413383 -0.400096 0.135880 -0.157563 -0.725925 -0.695295 0.261411 0.166350 -0.049349 0.152280 0.198169 0.255296 0.184627 0.200858 0.251282 0.219537 0.225056 0.215649 0.248766 0.258707 0.223383 0.229070 0.182268 0.255682 0.194392 0.207778 0.283262 0.299827 0.308531 0.289139 0.342461 0.303765 0.376854
chargesum: 0.00000
title: Mulliken charges with hydrogens summed into heavy atoms:
elementType: O O O N N N N N C C C C C C C C C C C C C
charge: -0.264025 -0.038099 -0.241238 -0.084813 -0.158256 -0.044193 -0.020978 -0.035178 0.178029 -0.121500 0.095654 0.031210 0.064319 0.135880 0.101144 -0.091203 -0.037442 0.261411 0.166350 -0.049349 0.152280
polarizability: 2.31585313e+02 1.59639311e+01 1.92300274e+02 -1.94671498e+01 6.55864141e+00 1.46541972e+02
1716.lowfreq: -13.1596 -6.5050 0.0004 0.0006 0.0009 2.5321 11.9521 19.6882 27.3113
frequency: 11.5875 18.6198 27.1817 43.6809 50.4826 52.4793 67.7811 104.1580 114.2665 141.4856 154.9143 175.9705 187.8891 209.3388 215.6161 221.4421 235.9825 238.5272 277.6083 286.8794 287.4879 298.8845 317.4549 325.1285 349.5781 372.1454 379.4697 388.7883 420.5502 446.7041 461.1030 493.0850 502.7751 505.9415 522.3356 548.5336 562.5034 580.5551 602.7202 631.5276 634.5145 656.6493 688.5349 717.3645 718.0044 747.5663 781.8167 796.5430 806.7652 849.8140 857.3531 914.8994 920.5804 944.0737 962.8663 967.4939 1005.0837 1023.9989 1045.3517 1048.1546 1061.3235 1070.7837 1088.7212 1095.1468 1137.6886 1158.0094 1175.9315 1182.7135 1191.9823 1200.8664 1230.3900 1238.4433 1245.6111 1261.1620 1271.2807 1289.2259 1296.7138 1297.5958 1311.5948 1330.3339 1348.6813 1355.6118 1362.5709 1371.9978 1372.3527 1390.3767 1397.7330 1439.2154 1446.5981 1457.0128 1460.8105 1462.5337 1472.9227 1475.4291 1483.8109 1489.2034 1499.4729 1557.0036 1606.6262 1612.6855 1623.3019 1665.2377 1669.6249 2943.4449 2945.6520 2961.8751 2970.0456 2975.8904 2977.4139 2986.3027 3001.4303 3033.3173 3035.7190 3039.8004 3054.3203 3060.2329 3067.3910 3078.5964 3097.3038 3487.1482 3514.9883 3522.5203 3530.5617 3555.3834 3622.4351 3676.1104
redmass: 5.9005 5.0806 4.9052 5.3530 6.2761 3.3665 4.5659 4.1352 3.1886 4.2472 2.6972 4.1265 3.7681 3.3201 1.3505 2.4970 1.6378 2.1551 2.3002 1.1186 3.2913 1.2555 2.8300 1.9980 2.0074 1.8448 2.3485 1.8642 3.8059 3.9087 1.2428 4.7729 1.4480 2.3398 4.0791 1.4964 3.1510 2.3903 6.1489 6.7269 1.8486 3.2305 7.2799 4.4578 3.2469 1.3923 5.9227 2.7409 3.4589 1.7052 1.8519 1.2811 2.3029 2.1424 1.9146 2.6360 2.3236 2.5366 3.7577 2.5577 2.1898 2.1583 1.6156 1.7393 1.9648 1.7874 2.2866 1.9605 2.4239 1.6641 1.4172 2.0792 1.8043 1.6238 1.7529 1.3236 1.2838 1.3535 1.1572 1.5488 1.5886 1.3355 1.6698 1.3939 1.2715 1.8280 1.2146 1.3469 1.1274 1.7410 1.0855 1.3164 1.1042 1.1017 1.0574 1.0590 1.9369 5.5060 4.2935 1.3690 1.2343 5.1729 3.5690 1.0666 1.0416 1.0791 1.0669 1.0375 1.0659 1.0737 1.0626 1.0983 1.0943 1.0948 1.0984 1.0998 1.0989 1.1046 1.0985 1.0450 1.0640 1.0770 1.0465 1.0772 1.0996 1.1014
irintensity: 0.5315 2.3890 2.2708 0.3295 0.7572 3.8672 0.8956 2.2938 7.2973 0.1807 0.1856 5.9191 0.9861 1.5794 1.0067 0.6681 24.5131 18.1334 13.9394 2.6377 6.7970 21.1695 39.8115 17.0404 44.3381 61.3919 7.8108 10.9390 50.0320 3.5130 245.3028 2.7347 169.0303 118.1640 11.3218 100.4495 18.3645 143.7209 4.1980 5.8203 151.0123 14.9887 13.6610 33.5927 3.6920 4.6661 9.9638 5.4161 0.8015 1.6143 3.8407 4.6912 3.4612 7.4714 5.2881 3.6276 6.6061 33.3312 36.4627 226.2459 48.9676 12.9171 13.2540 43.1657 6.7470 14.5827 16.0260 11.4698 6.7620 10.7511 23.2471 20.1167 58.6110 7.8941 50.1134 38.2434 7.1148 14.1227 67.7734 4.3739 1.4863 0.9982 1.5593 31.8219 12.7431 7.9171 18.2260 43.1687 25.4243 103.5684 4.2655 60.3698 15.4840 10.2531 52.8581 18.3987 203.1669 362.1989 330.3567 237.2270 64.6224 329.6890 138.6071 21.3097 41.5284 80.0183 5.4598 25.6841 25.9657 51.9192 62.0973 8.8078 7.3124 48.5060 19.1559 6.2153 116.2302 29.0763 16.3496 7.1101 26.5360 13.1716 37.4632 28.1964 15.4186 44.6082
temp: 298.150 k
press: 1.00000 atm
elementType: 8 8 8 7 7 7 7 7 6 6 6 6 6 6 6 6 6 6 6 6 6 1 1 1 1 1 1 1 1 1 1 1 1 1 1 1 1 1 1 1 1 1 1 1
symmnumber: 1
zpe: 958297.3 jmol-1
zpe.correction: 0.364996 hartree
zpe.thermalcorrener: 0.388690 hartree
zpe.thermalcorrenthalpy: 0.389635 hartree
zpe.thermalcorrgfe: 0.309446 hartree
zpe.sumelectzpe: -1006.992026 hartree
zpe.sumelectthermal: -1006.968332 hartree
zpe.sumelectthermalent: -1006.967388 hartree
zpe.sumelectthermalfe: -1007.047577 hartree
dipole: -1.6582 9.4851 0.2744
dipole: 9.6328
quadrupole: -113.9446 -117.3104 -129.4442
quadrupole: -0.8260 -16.5467 3.9151
quadrupole: 6.2885 2.9227 -9.2111 -0.8260 -16.5467 3.9151
hfenergy: -1007.3570226 hartree
pointgroup: C01 [X(C13H23N5O3)]
dipole: -0.3462343 3.0722901 -2.1918168 debye
polarizability: 235.2329636|0.4176314|182.0635712|-19.7478489|-19.082218|153.1310241 unknown
InChI: InChI=1S/C13H23N5O3/c1-7(2)6-8-10(15)17-13(18-11(8)19)16-5-3-4-9(14)12(20)21/h7,9,16-17,20H,3-6,14-15H2,1-2H3
charge 0 multiplicity 1
44 atoms
O  -1.694187 -1.649395 0.979242
O  6.603847 0.111897 0.337498
O  5.232605 1.031496 1.968529
N  0.93321 1.04711 -1.822944
N  -1.226765 1.775693 -1.190229
N  -0.354899 -0.314827 -0.393724
N  3.744914 -1.320711 2.09609
N  -3.331367 2.662658 -0.631577
C  -5.103338 -0.469086 0.468619
C  -3.87176 0.235209 1.131042
C  2.901372 0.142774 -0.524173
C  3.90181 -1.027878 -0.445917
C  2.042478 0.073307 -1.807848
C  -2.647498 0.447525 0.259322
C  4.63011 -1.146274 0.944868
C  -5.826756 0.426909 -0.566362
C  -4.727962 -1.830155 -0.161259
C  -2.433958 1.602274 -0.479967
C  -0.22236 0.79555 -1.09856
C  -1.574753 -0.579651 0.300523
C  5.47961 0.097313 1.173655
H  -5.817076 -0.661971 1.298507
H  -3.543638 -0.404468 1.971699
H  -4.209764 1.202125 1.562942
H  3.43289 1.114425 -0.472522
H  2.214113 0.088823 0.339826
H  4.666642 -0.957302 -1.244051
H  3.356419 -1.981249 -0.597577
H  2.65842 0.243587 -2.711343
H  1.589346 -0.930863 -1.879372
H  5.331992 -2.000115 0.8603
H  -6.729871 -0.079135 -0.955774
H  -5.172462 0.644089 -1.432034
H  -6.160709 1.385778 -0.116913
H  -4.174644 -2.460872 0.55456
H  -5.635054 -2.368747 -0.495653
H  -4.071852 -1.686818 -1.040206
H  1.133842 2.003484 -2.117714
H  -1.207882 2.46383 -1.946171
H  3.50984 -0.455998 2.589928
H  2.955649 -1.953086 1.950739
H  -4.284728 2.531121 -0.303927
H  -2.985134 3.619412 -0.693147
H  7.120812 0.946416 0.503175
