program: Gaussian 09
title: 000276399
version: EM64L-G09RevD.01
frameworkgroup: C1[X(C18H25N3O5)]
method: RPBEPBE
basis: SDD
operation: Freq
keyword: #p
keyword: freq=noraman
keyword: PBEPBE/SDD
title: #p freq=noraman PBEPBE/SDD
converged: YES YES NO NO
title: Mulliken charges:
elementType: O O O O O N N N C C C C C C C C C C C C C C C C C C H H H H H H H H H H H H H H H H H H H H H H H H H
charge: -0.294301 -0.438353 -0.456321 -0.241399 -0.433246 -0.224772 -0.190085 -0.050237 -0.153011 -0.213950 -0.135623 -0.029683 0.184870 0.279951 -0.364442 -0.064542 -0.390864 -0.351514 -0.617609 -0.308134 -0.321485 -0.566587 0.343057 0.376322 -0.832219 -0.821779 0.276231 0.258503 0.231198 0.268739 0.188320 0.230538 0.264597 0.236407 0.232222 0.238278 0.381443 0.366670 0.332180 0.222307 0.187360 0.191503 0.223900 0.255929 0.350607 0.223019 0.242043 0.228479 0.224377 0.225651 0.235458
chargesum: 0.00000
title: Mulliken charges with hydrogens summed into heavy atoms:
elementType: O O O O O N N N C C C C C C C C C C C C C C C C C C
charge: -0.294301 -0.056910 -0.089652 -0.241399 -0.082639 -0.224772 -0.190085 -0.050237 0.123220 0.044553 0.095575 0.239057 0.184870 0.279951 0.054416 -0.064542 0.110139 0.118986 -0.285429 0.101533 0.093918 -0.310658 0.343057 0.376322 -0.138676 -0.136294
polarizability: 3.13283428e+02 1.47255228e+01 2.47172226e+02 6.41653231e+00 4.72655690e+00 1.59148056e+02
1716.lowfreq: -8.7435 -3.9464 -0.0008 -0.0007 -0.0005 8.1404 29.1668 39.1342 41.8483
frequency: 29.0826 39.0097 41.8427 56.5371 63.7654 83.2636 87.5786 98.5541 114.7141 118.2930 142.5202 145.7402 166.6880 173.4437 203.2595 211.8970 235.1252 239.1077 247.8275 273.4099 296.4387 298.9542 301.4769 307.3926 339.5634 341.0090 375.5207 389.8526 411.0466 425.3615 432.6807 448.3695 458.8389 464.8788 488.0470 515.6347 527.4377 550.0634 565.7105 590.3990 615.9750 619.6374 650.3442 668.1748 685.7181 701.8402 731.3542 757.4780 766.3327 792.8978 795.7712 821.9411 826.0589 836.2027 858.4987 889.7481 907.9095 929.5330 936.9054 960.2796 966.3819 986.7620 1002.4830 1007.4512 1013.8936 1023.4957 1032.6219 1039.0100 1044.0760 1052.7651 1053.5598 1057.6385 1073.8578 1081.4333 1089.2906 1105.0311 1109.7886 1141.1210 1151.3707 1181.0649 1188.9106 1195.6016 1210.5941 1235.8709 1247.2650 1248.3292 1258.3654 1271.5605 1275.9114 1281.1299 1286.0000 1291.6914 1297.9911 1299.8286 1310.5224 1332.3128 1336.7872 1341.0399 1351.7811 1368.4556 1370.1782 1372.1061 1377.1856 1389.5363 1393.7469 1397.2649 1401.7932 1406.9084 1437.6788 1444.5552 1451.6138 1455.7703 1456.0529 1462.4842 1471.8026 1473.3202 1476.5386 1480.5183 1484.8428 1528.4012 1582.6129 1635.3689 2939.9761 2950.5723 2953.2850 2953.5962 2967.4866 2970.0829 2971.2664 2976.2065 3019.2664 3038.3695 3042.5870 3056.5656 3067.2951 3072.6270 3080.7319 3082.6240 3083.4393 3084.7831 3086.0912 3087.6268 3122.0605 3151.6757 3421.6397 3453.3896 3554.1991
redmass: 6.0067 5.3351 4.8177 3.8838 4.0101 4.1568 4.4037 5.3612 5.3405 1.2031 2.7115 3.5183 2.7803 1.2840 3.0540 2.1979 4.7763 2.5016 4.5582 3.3383 5.6671 2.7972 2.9025 3.7228 3.3570 3.2531 2.2202 2.4662 3.0346 1.2422 3.8477 3.3312 2.8351 5.6101 4.6725 4.2978 3.4908 3.0014 2.4682 1.5654 3.7179 5.7141 4.0964 4.9369 3.7002 7.6713 5.1346 4.7423 5.3300 4.1203 2.9280 4.0940 4.6134 1.6814 4.7384 1.4307 2.3895 7.5697 1.2925 3.4225 2.8814 2.6254 1.5526 2.2640 2.1738 2.2652 1.5758 3.1194 3.3509 1.7998 2.0121 3.7901 3.3485 3.7466 3.1839 2.2386 2.4302 4.5090 3.5480 1.1813 2.0183 1.1087 1.2692 1.9520 1.3149 1.2492 1.6241 1.2234 2.0197 1.3497 1.4607 1.3199 1.2973 2.0581 1.3387 1.5563 1.2226 1.5280 1.6945 1.4701 1.4053 1.3184 1.9983 1.3409 1.2521 1.4818 1.7483 1.3930 1.9477 1.0831 1.0983 1.0830 1.0837 1.0482 1.4245 1.6414 1.0513 1.1984 1.4655 6.3689 7.7709 7.2502 1.0699 1.0673 1.0684 1.0685 1.0377 1.0383 1.0658 1.0854 1.0848 1.0969 1.0969 1.0867 1.0947 1.0874 1.0949 1.0985 1.0949 1.0957 1.0977 1.0971 1.0931 1.0923 1.0663 1.0647 1.0657
irintensity: 0.8376 0.9941 0.1101 0.1776 3.6422 1.6170 1.0773 9.4129 5.8091 0.7543 8.7573 1.6887 4.4986 0.0481 22.1917 99.5352 12.1058 3.3673 8.2211 1.1094 10.8143 8.2086 6.0939 6.1113 18.0154 73.3544 42.8801 3.5475 12.0294 192.1763 13.4779 7.6931 2.4511 1.2720 0.4817 1.0392 0.1061 16.9527 13.4061 55.3413 29.5157 17.2962 2.1089 0.1924 3.2367 10.2337 1.5885 1.1129 6.1775 13.3072 21.7601 17.8419 10.7785 0.4759 78.7032 16.4832 2.6260 227.6198 10.4208 32.7497 43.4540 49.0027 12.9388 23.0663 24.9600 13.7554 7.8483 43.2264 24.5204 3.2484 27.1551 51.5911 7.2651 47.4488 14.5972 4.0987 14.9909 6.1245 18.7781 31.1954 8.7068 2.7024 8.8195 53.4625 10.9555 10.3421 96.0302 18.0098 26.8026 14.1293 55.6627 1.7431 4.5178 22.4498 1.5014 77.3655 9.0236 49.5407 34.4892 12.8402 2.0565 17.1133 0.8227 37.7909 8.9573 13.4416 19.0688 8.0803 4.1325 3.1835 32.3463 4.4926 8.8296 0.0496 124.3235 11.2031 28.1141 11.9115 31.1478 338.3587 19.7610 4.7858 37.3526 33.8364 14.1882 123.6038 59.0406 35.2628 55.7532 57.8686 24.9328 36.0255 5.9348 2.9620 2.5760 37.7624 19.2730 29.4465 18.4876 28.4990 8.5258 38.4889 12.5224 9.2234 193.8231 23.1142 7.2138
temp: 298.150 k
press: 1.00000 atm
elementType: 8 8 8 8 8 7 7 7 6 6 6 6 6 6 6 6 6 6 6 6 6 6 6 6 6 6 1 1 1 1 1 1 1 1 1 1 1 1 1 1 1 1 1 1 1 1 1 1 1 1 1
symmnumber: 1
zpe: 1094784.7 jmol-1
zpe.correction: 0.416981 hartree
zpe.thermalcorrener: 0.441905 hartree
zpe.thermalcorrenthalpy: 0.442849 hartree
zpe.thermalcorrgfe: 0.362602 hartree
zpe.sumelectzpe: -1239.269293 hartree
zpe.sumelectthermal: -1239.244370 hartree
zpe.sumelectthermalent: -1239.243426 hartree
zpe.sumelectthermalfe: -1239.323673 hartree
dipole: -0.6207 0.2377 2.5182
dipole: 2.6044
quadrupole: -152.2642 -159.0478 -161.9347
quadrupole: 9.4027 3.6329 9.3208
quadrupole: 5.4847 -1.2989 -4.1858 9.4027 3.6329 9.3208
hfenergy: -1239.6862749 hartree
pointgroup: C01 [X(C18H25N3O5)]
dipole: -0.0050895 0.3591228 0.9596446 debye
polarizability: 312.0067073|-2.8144179|241.3351723|-26.7156145|-15.0381003|166.2618306 unknown
InChI: InChI=1S/C18H25N3O5/c1-10-7-12-13(8-11(10)2)21(17-16(24)15(23)14(9-22)26-17)18(19-12)20-3-5-25-6-4-20/h7-8,14-17,22-24H,3-6,9H2,1-2H3
charge 0 multiplicity 1
51 atoms
O  1.09094 1.86373 -1.052212
O  -0.274975 1.734534 2.3657
O  -1.536136 3.506244 0.763046
O  5.05593 -2.15519 -0.810294
O  0.610238 3.462938 -3.386534
N  0.302547 -0.134668 0.15655
N  2.340912 -1.496606 -0.071306
N  0.122543 -2.434815 0.303709
C  1.044017 1.119371 0.220887
C  0.557933 2.187152 1.264084
C  -0.130137 3.337779 0.415657
C  0.003931 2.898031 -1.055386
C  0.958313 -1.40431 0.110127
C  -1.081215 -0.422145 0.335839
C  0.456464 3.984875 -2.028535
C  -1.15369 -1.84804 0.45887
C  2.908842 -1.049152 -1.384115
C  2.95929 -2.774141 0.380635
C  -2.245985 0.375445 0.363935
C  4.43124 -0.896431 -1.246004
C  4.480685 -2.58317 0.477636
C  -2.39999 -2.47295 0.666926
C  -3.495425 -0.262285 0.572334
C  -3.574088 -1.688979 0.731506
C  -4.757754 0.582218 0.60939
C  -4.919644 -2.357917 0.953592
H  2.085576 0.823146 0.424053
H  1.455895 2.596306 1.753041
H  0.411265 4.288126 0.597207
H  -0.938521 2.43657 -1.406737
H  1.403729 4.435775 -1.660169
H  -0.314727 4.770167 -2.097526
H  2.450688 -0.09338 -1.690024
H  2.681798 -1.808539 -2.164324
H  2.718639 -3.592759 -0.329679
H  2.536081 -3.047046 1.361701
H  -0.909863 1.026105 2.063741
H  -1.616782 3.310517 1.738378
H  -2.222409 1.460118 0.210186
H  4.89235 -0.659464 -2.218678
H  4.663528 -0.088136 -0.517787
H  4.717058 -1.83043 1.260803
H  4.979597 -3.535814 0.719396
H  -2.447325 -3.562152 0.765171
H  1.209929 2.674584 -3.338591
H  -5.30085 0.463579 1.566991
H  -4.526839 1.653151 0.4808
H  -5.464782 0.291938 -0.191811
H  -5.412337 -1.988048 1.873584
H  -5.618028 -2.158972 0.117978
H  -4.809954 -3.451361 1.047255
