program: Gaussian 09
title: 000276375
version: EM64L-G09RevD.01
frameworkgroup: C1[X(C14H20O4)]
method: RPBEPBE
basis: SDD
operation: Freq
keyword: #pfreq=noraman
keyword: PBEPBE/SDD
title: #p freq=noraman PBEPBE/SDD
converged: NO NO NO NO
title: Mulliken charges:
elementType: O O O O C C C C C C C C C C C C C C H H H H H H H H H H H H H H H H H H H H
charge: -0.270903 -0.280202 -0.270898 -0.280198 -0.213671 -0.213667 -0.142473 -0.142477 0.270438 0.270441 -0.486844 -0.486842 -0.509838 -0.509826 -0.347519 -0.299193 -0.347522 -0.299198 0.231413 0.231411 0.274371 0.274369 0.211267 0.223504 0.223504 0.211268 0.247435 0.222535 0.222536 0.247414 0.235406 0.204170 0.210163 0.219943 0.204171 0.235406 0.219945 0.210163
chargesum: 0.00000
title: Mulliken charges with hydrogens summed into heavy atoms:
elementType: O O O O C C C C C C C C C C C C C C
charge: -0.270903 -0.280202 -0.270898 -0.280198 0.017741 0.017744 0.131898 0.131893 0.270438 0.270441 -0.052073 -0.052071 -0.039867 -0.039876 0.092057 0.130913 0.092055 0.130910
polarizability: 1.81737651e+02 1.06011099e+01 1.43262818e+02 -4.42702607e+00 -1.45823423e+00 1.23262665e+02
1716.lowfreq: -20.5788 -12.0519 -0.0005 0.0003 0.0009 13.2337 33.3705 39.8693 39.9889
frequency: 33.3704 38.4955 39.8868 78.9659 117.0785 118.8719 150.0955 179.1476 186.6526 254.2186 270.5797 298.8491 306.9027 313.8171 401.2102 450.5281 460.2730 462.7740 471.4508 562.9033 624.4766 656.6897 657.8471 684.2172 705.6457 748.8789 779.7336 790.0009 813.6493 825.0503 842.8895 843.7193 846.6923 862.8945 864.1840 903.1588 913.2637 915.9227 927.4136 931.0356 960.7165 966.3820 968.5559 976.4533 983.5200 984.0699 1013.4105 1046.0830 1051.7764 1068.6075 1071.5793 1096.7018 1106.7080 1106.8733 1121.2548 1138.5017 1148.3315 1163.5325 1163.7950 1165.3209 1175.6752 1187.6759 1191.5760 1194.5997 1202.2046 1206.0420 1235.8399 1245.8332 1251.6507 1270.4208 1283.5614 1291.2378 1313.2360 1316.8251 1317.2954 1319.1328 1322.0010 1322.0297 1328.4659 1337.3969 1454.6462 1454.7840 1466.5518 1467.0086 1479.7986 1479.8344 1491.1854 1491.2768 2977.0622 2977.1594 2999.5926 2999.7294 3001.1901 3001.6899 3019.0459 3019.4415 3024.5661 3027.8433 3056.8677 3058.3128 3059.6598 3059.7243 3063.1875 3064.4344 3097.4794 3097.5474 3100.8161 3101.2394
redmass: 3.8187 2.4284 2.5056 3.3285 3.0625 6.0728 2.7357 5.5207 2.5444 2.6964 4.7793 2.5433 2.7986 2.6386 4.2944 5.0863 4.0179 3.5081 3.8063 2.8318 2.4571 3.2860 3.2805 4.3289 8.8865 4.0830 3.3609 3.9554 2.5633 2.9603 1.5530 1.5611 2.7425 2.2949 1.9314 2.5909 3.8818 3.0626 2.0204 2.4447 2.2529 4.3457 4.0453 2.4191 4.3475 3.6909 1.6688 2.8153 2.4346 1.6045 1.7928 2.8887 1.6466 1.5820 1.8411 1.4366 1.5809 1.4428 1.1822 1.7936 1.6161 1.2898 1.5540 1.3347 1.7029 1.6182 1.6935 1.7669 1.6586 1.3817 1.5078 1.3996 1.6236 1.2784 1.2505 1.3818 1.3299 1.3426 1.6908 1.5151 1.0878 1.0887 1.0905 1.0921 1.0874 1.0872 1.0884 1.0884 1.0672 1.0672 1.0595 1.0597 1.0580 1.0584 1.0650 1.0651 1.0865 1.0867 1.0957 1.0969 1.1075 1.1068 1.0963 1.0943 1.1000 1.1000 1.1016 1.1015
irintensity: 1.9181 0.0071 8.7310 0.5313 0.0000 4.5105 0.0000 0.0000 8.5515 7.6068 0.0000 4.6745 0.0000 0.0000 19.3424 9.6795 0.0001 15.4268 0.0000 0.0000 9.0265 0.0001 4.9692 0.0000 4.6443 0.0000 17.6001 0.0000 0.0000 82.1670 0.3151 0.0000 4.5006 0.0000 11.9170 0.0000 114.6450 0.0000 18.2030 0.0000 8.2617 0.0000 35.4242 0.0000 37.9945 0.0000 17.8213 0.0001 168.6290 0.0001 102.8051 0.0000 0.0015 18.1482 0.0000 9.6200 0.0000 22.5121 0.0003 25.2010 0.0000 16.3267 57.3082 0.0003 20.5111 0.0000 0.0000 46.3533 10.1429 0.0000 0.0000 6.3292 0.0001 5.2877 0.0002 3.7607 0.0043 7.0397 54.1886 0.0000 28.7572 0.5139 0.0003 23.3226 13.3962 0.0027 0.0021 4.7021 3.1793 89.8243 0.9292 74.2007 172.8697 0.0859 0.3831 20.5715 59.0040 0.0014 23.3659 0.0033 52.1687 1.6130 0.0342 77.9577 84.9069 1.3249 25.1098 30.4364
temp: 298.150 k
press: 1.00000 atm
elementType: 8 8 8 8 6 6 6 6 6 6 6 6 6 6 6 6 6 6 1 1 1 1 1 1 1 1 1 1 1 1 1 1 1 1 1 1 1 1
symmnumber: 1
zpe: 840615.8 jmol-1
zpe.correction: 0.320174 hartree
zpe.thermalcorrener: 0.335793 hartree
zpe.thermalcorrenthalpy: 0.336738 hartree
zpe.thermalcorrgfe: 0.276090 hartree
zpe.sumelectzpe: -844.926524 hartree
zpe.sumelectthermal: -844.910904 hartree
zpe.sumelectthermalent: -844.909960 hartree
zpe.sumelectthermalfe: -844.970608 hartree
dipole: -0.0001 0.0001 0.0000
dipole: 0.0001
quadrupole: -91.8670 -104.3124 -111.5006
quadrupole: 13.3475 -6.7373 -6.3042
quadrupole: 10.6930 -1.7525 -8.9406 13.3475 -6.7373 -6.3042
hfenergy: -845.2466977 hartree
pointgroup: C01 [X(C14H20O4)]
dipole: -0.0000341 -0.0000316 0.0000262 debye
polarizability: 181.8365719|-10.3662868|142.3708884|4.0667861|-4.6311066|124.055674 unknown
InChI: InChI=1S/C14H20O4/c1-3-13(15-5-6-16-13)11-9(1)12-10(11)2-4-14(12)17-7-8-18-14/h9-12H,1-8H2
charge 0 multiplicity 1
38 atoms
O  -3.281515 -0.895399 -0.536401
O  -2.924838 0.657396 1.183888
O  3.281611 0.895567 0.5362
O  2.924923 -0.657225 -1.184085
C  -1.018326 0.152786 -0.414517
C  1.018425 -0.152621 0.414338
C  0.023781 -1.036004 -0.419555
C  -0.023681 1.036162 0.419382
C  -2.242872 -0.377107 0.375416
C  2.242967 0.377275 -0.375607
C  -0.647911 -2.20547 0.347668
C  0.648021 2.205626 -0.34784
C  -1.716029 -1.530443 1.245008
C  1.716136 1.530614 -1.245196
C  -4.093405 0.284649 -0.889884
C  -4.092979 1.140614 0.407928
C  4.093486 -0.284484 0.889696
C  4.09302 -1.140492 -0.408092
H  -1.313915 0.574887 -1.391539
H  1.314014 -0.574725 1.391363
H  0.43057 -1.34886 -1.394752
H  -0.43047 1.349017 1.394584
H  0.080084 -2.804692 0.924508
H  -1.150187 -2.878675 -0.371628
H  1.150305 2.878827 0.371463
H  -0.079975 2.804852 -0.924675
H  -2.537196 -2.198427 1.548591
H  -1.26438 -1.093774 2.154824
H  1.264482 1.093951 -2.155013
H  2.537347 2.198639 -1.548796
H  -5.089724 -0.083182 -1.179269
H  -3.637896 0.833032 -1.738889
H  -3.980204 2.220344 0.198919
H  -4.99461 0.973575 1.023505
H  3.63799 -0.832835 1.738723
H  5.089815 0.08334 1.179049
H  4.994665 -0.973531 -1.023665
H  3.980171 -2.220205 -0.199049
