program: Gaussian 09
title: 000276373
version: EM64L-G09RevD.01
frameworkgroup: C1[X(C14H16O4)]
method: RPBEPBE
basis: SDD
operation: Freq
keyword: #pfreq=noraman
keyword: PBEPBE/SDD
title: #p freq=noraman PBEPBE/SDD
converged: YES YES NO NO
title: Mulliken charges:
elementType: O O O O C C C C C C C C C C C C C C H H H H H H H H H H H H H H H H
charge: -0.292904 -0.249357 -0.277578 -0.283666 -0.274613 -0.308123 -0.194460 -0.317042 0.278070 0.231896 -0.169301 -0.220858 -0.258071 -0.203350 -0.307708 -0.332234 -0.333687 -0.299246 0.306182 0.265205 0.275796 0.254929 0.246862 0.233249 0.236404 0.242370 0.213283 0.225888 0.209402 0.233854 0.206773 0.233206 0.208164 0.220670
chargesum: 0.00000
title: Mulliken charges with hydrogens summed into heavy atoms:
elementType: O O O O C C C C C C C C C C C C C C
charge: -0.292904 -0.249357 -0.277578 -0.283666 0.031569 -0.042918 0.081335 -0.062113 0.278070 0.231896 0.077560 0.012391 -0.021666 0.039019 0.131462 0.111021 0.106292 0.129588
polarizability: 1.84191187e+02 -6.06841658e+00 1.40653605e+02 8.51073567e+00 -3.59192497e+00 1.22702352e+02
1716.lowfreq: -16.2046 -7.9980 -0.0002 0.0006 0.0006 4.8952 32.0786 46.7698 72.5605
frequency: 31.9875 46.6230 72.4279 99.4958 150.3816 166.5965 170.4570 226.9897 264.0485 265.9453 275.9730 325.6243 376.6517 401.8263 436.8454 448.3503 465.3161 542.8499 568.1893 615.0628 618.5895 676.1798 692.0394 697.3180 706.3534 729.7463 765.2311 779.3552 819.2230 844.6877 853.6859 859.2419 868.2363 887.6000 904.2108 918.0254 919.4523 921.8014 937.3298 952.9124 962.8461 977.9406 979.5226 982.8974 986.0136 998.5860 1012.6893 1032.7093 1071.5219 1083.1507 1088.1301 1093.8509 1102.1325 1108.9431 1123.2796 1132.5790 1160.1479 1162.3026 1170.1410 1185.7802 1196.6575 1200.6121 1212.1361 1247.2160 1256.7923 1261.1652 1275.4137 1295.0924 1314.6123 1319.3346 1322.6271 1323.6150 1327.4255 1341.8276 1471.0431 1472.4593 1475.5913 1477.1853 1584.9424 1619.4580 2981.0751 2984.5218 2989.0215 2996.2343 3024.4637 3069.0404 3079.2043 3089.0135 3089.5355 3098.3992 3103.8426 3105.3247 3136.8383 3172.2766 3175.5705 3214.0036
redmass: 3.1376 3.5553 4.5668 4.5507 4.2797 4.3043 3.1671 2.8180 3.9219 3.5049 3.5331 4.3127 4.6078 4.3580 3.9295 3.6378 5.8078 3.2548 3.0247 2.3837 2.3681 4.9401 7.0949 4.5176 3.0240 5.0124 2.3040 1.8863 3.5477 4.2333 3.8733 2.2709 2.2498 2.3202 2.9993 2.9246 2.3937 2.1273 3.8151 1.4123 2.1239 3.2609 3.2273 2.8726 3.5063 2.8952 3.5130 2.2085 1.9974 1.9496 1.3559 2.4400 1.4636 1.6797 2.3077 1.4296 1.1635 1.1597 1.4050 1.6077 1.2885 1.4568 1.9176 1.6791 1.5093 1.8728 1.7356 1.5352 1.3153 1.2975 1.7341 1.2702 1.2475 1.8895 1.0883 1.0895 1.0965 1.0974 5.9699 6.9874 1.0686 1.0683 1.0610 1.0619 1.0844 1.0853 1.1010 1.0999 1.0904 1.1013 1.1019 1.0913 1.0875 1.0910 1.1052 1.1065
irintensity: 8.6255 5.4445 2.0399 1.2144 3.7447 1.5146 2.4500 1.6528 0.7104 2.0236 2.7305 7.0751 3.0055 9.4537 2.9575 4.4908 20.4157 2.2805 11.7319 3.7605 2.0781 1.3432 20.8460 7.5307 12.0180 9.2580 71.3654 24.7290 25.7230 7.7223 1.2960 1.2847 1.5614 21.0120 51.3601 22.4434 61.9810 44.3419 22.1912 0.6881 0.8438 10.3472 12.1149 19.7222 16.4470 51.0863 5.8853 72.8150 63.8960 26.3952 41.7383 56.2518 1.6825 28.4132 56.2225 35.1748 1.1887 0.5606 5.9505 25.8324 33.7571 1.3020 6.7979 30.0808 51.1074 95.7068 9.4997 10.4742 2.0404 1.8608 6.3540 4.9080 1.7333 32.6476 6.4826 6.7664 0.3660 0.7300 1.9372 9.7932 80.3555 59.9506 67.8342 70.4047 11.4359 4.2360 38.0009 15.0334 50.1600 29.9273 27.8310 25.0440 9.9526 6.3488 22.3427 11.1731
temp: 298.150 k
press: 1.00000 atm
elementType: 8 8 8 8 6 6 6 6 6 6 6 6 6 6 6 6 6 6 1 1 1 1 1 1 1 1 1 1 1 1 1 1 1 1
symmnumber: 1
zpe: 717888.6 jmol-1
zpe.correction: 0.273429 hartree
zpe.thermalcorrener: 0.287965 hartree
zpe.thermalcorrenthalpy: 0.288909 hartree
zpe.thermalcorrgfe: 0.231468 hartree
zpe.sumelectzpe: -842.534606 hartree
zpe.sumelectthermal: -842.520071 hartree
zpe.sumelectthermalent: -842.519127 hartree
zpe.sumelectthermalfe: -842.576568 hartree
dipole: -0.4105 -0.8572 -0.4431
dipole: 1.0486
quadrupole: -80.2565 -95.7812 -112.0222
quadrupole: -0.2469 8.5970 -3.7505
quadrupole: 15.7635 0.2387 -16.0022 -0.2469 8.5970 -3.7505
hfenergy: -842.8080357 hartree
pointgroup: C01 [X(C14H16O4)]
dipole: -0.1568139 -0.3360709 -0.1807503 debye
polarizability: 183.2726342|-6.2557435|140.7492071|11.0222873|-3.9413934|123.5253023 unknown
InChI: InChI=1S/C14H16O4/c1-2-11-12-9(3-4-13(12)15-5-6-16-13)10(1)14(11)17-7-8-18-14/h1-4,9-12H,5-8H2
charge 0 multiplicity 1
34 atoms
O  -2.20309 -0.836649 -1.223106
O  -3.041036 -0.353722 0.923866
O  2.756055 -0.949938 -1.015428
O  2.337827 -0.342724 1.234893
C  0.426207 -0.32427 -0.488517
C  -0.536348 -0.607609 0.724551
C  -0.147008 1.015499 -1.0972
C  -1.40967 1.324635 -0.180392
C  -1.881494 -0.158243 0.054865
C  1.918624 -0.052188 -0.170878
C  -0.384531 0.511366 1.754275
C  -0.906789 1.653544 1.219629
C  1.014952 1.982962 -1.013829
C  2.133825 1.41093 -0.49824
C  -3.511562 -1.509488 -1.06438
C  -4.182357 -0.681611 0.043677
C  3.961627 -1.260642 -0.223389
C  3.389721 -1.384994 1.199365
H  0.362439 -1.153538 -1.210702
H  -0.510707 -1.638108 1.103984
H  -0.495057 0.873203 -2.136397
H  -2.147599 2.003721 -0.631794
H  0.125665 0.392138 2.710036
H  -0.916084 2.649737 1.666884
H  0.94069 3.024635 -1.344993
H  3.100381 1.895273 -0.333354
H  -3.361894 -2.561362 -0.753916
H  -4.025917 -1.466841 -2.037899
H  -4.64297 0.24266 -0.358324
H  -4.910839 -1.238045 0.652986
H  4.705508 -0.442036 -0.295656
H  4.383475 -2.194001 -0.627315
H  2.940545 -2.383151 1.367755
H  4.114214 -1.153338 1.997745
