program: Gaussian 09
title: 000276465
version: EM64L-G09RevD.01
frameworkgroup: C1[X(C22H20N2O7S)]
method: RPBEPBE
basis: SDD
operation: Freq
keyword: #p
keyword: freq=noraman
keyword: PBEPBE/SDD
title: #p freq=noraman PBEPBE/SDD
converged: YES YES NO NO
title: Mulliken charges:
elementType: S O O O O O O O N N C C C C C C C C C C C C C C C C C C C C C C H H H H H H H H H H H H H H H H H H H H
charge: 0.952219 -0.512175 -0.505866 -0.223586 -0.423152 -0.249532 -0.230735 -0.181765 -0.403168 0.016710 -0.556595 0.294140 0.551853 -0.063407 0.204109 -0.306204 -0.484126 -0.478787 -0.244677 -0.227684 0.236091 -0.336593 0.446801 -0.373541 -0.365334 -0.339979 0.239876 -0.231291 -0.233663 0.126256 -0.796378 -0.544211 0.283527 0.209671 0.233352 0.337227 0.239780 0.285119 0.290234 0.276455 0.247741 0.247649 0.283138 0.236520 0.240954 0.231504 0.247802 0.231334 0.245542 0.235012 0.258247 0.383582
chargesum: 0.00000
title: Mulliken charges with hydrogens summed into heavy atoms:
elementType: S O O O O O O O N N C C C C C C C C C C C C C C C C C C C C C C
charge: 0.952219 -0.512175 -0.505866 -0.223586 -0.039571 -0.249532 -0.230735 -0.181765 -0.403168 0.016710 -0.063396 0.294140 0.551853 -0.063407 0.204109 -0.072852 -0.146899 -0.239007 0.040443 0.062551 0.236091 -0.060138 0.446801 -0.125800 -0.117686 -0.056841 0.239876 0.005229 0.007291 0.126256 -0.085738 0.194590
polarizability: 3.90399185e+02 2.32812423e+01 3.14360209e+02 -1.55298303e+01 -8.32324915e+00 2.69304168e+02
1716.lowfreq: -21.1148 -7.8183 -6.3168 -0.0010 -0.0008 -0.0006 1.3996 9.8645 15.0735
frequency: -20.6915 8.5209 14.8889 17.5370 29.4298 31.2149 33.7880 54.2916 60.4290 77.0602 94.4106 97.5815 105.5593 109.4534 115.0214 129.4582 137.6930 159.9256 173.8362 192.7637 202.1252 224.6025 229.5765 237.9530 249.7175 264.4666 278.8785 292.7133 307.2799 327.8572 346.6664 357.6722 373.4589 386.1749 389.1693 397.8867 405.6393 417.4995 428.1396 450.6259 470.0481 501.5491 531.7484 542.9084 548.3339 568.5638 576.9643 578.8278 584.8081 598.4284 604.1786 620.3748 653.2247 669.7682 682.6217 705.0359 707.6296 718.8447 742.0225 770.3894 773.6012 775.2919 778.1860 794.0083 808.7299 825.2643 826.2018 847.7045 886.8168 910.0123 918.8471 951.3967 961.5525 967.6312 968.7276 980.6809 990.2682 991.2034 992.8015 997.8690 1003.1961 1012.5255 1024.8327 1046.5445 1049.3631 1049.8831 1064.3094 1103.2896 1119.4202 1121.8652 1149.6041 1161.1887 1162.4572 1170.4424 1179.9046 1184.7397 1203.3636 1218.6448 1234.5231 1253.6085 1267.0679 1269.3294 1291.3758 1296.5502 1313.4132 1344.9935 1358.6940 1374.9469 1379.9657 1390.7907 1390.8489 1399.1771 1421.8353 1427.0942 1446.2231 1465.9183 1469.8954 1470.2484 1470.4357 1471.3756 1473.4880 1480.3008 1485.3608 1572.1839 1580.4724 1590.9087 1591.6201 1592.0429 1613.6611 1636.3137 2935.4329 2981.9818 2989.1359 2998.7519 3064.8700 3091.0574 3094.1913 3136.6408 3137.2888 3138.0722 3138.6223 3144.2135 3152.9048 3154.2055 3159.5520 3165.2158 3166.3057 3179.8918 3181.1254 3526.5843
redmass: 1.0463 5.4029 5.9165 5.8745 8.0589 5.5375 4.2991 6.9398 6.6635 6.8973 7.4492 8.1724 3.4924 5.5328 5.0880 6.6814 6.2394 2.7101 4.9416 5.0459 7.2470 8.0726 4.8181 2.3311 5.6493 3.0528 5.3792 4.6572 4.5540 6.5203 3.7024 5.7676 4.0645 5.9656 4.7600 7.1767 2.8653 5.0027 10.1578 3.6357 4.1500 3.2221 6.6237 3.7120 4.5015 4.8602 2.3650 2.4745 3.8863 5.5488 5.6014 6.9564 5.8070 5.1303 3.8658 3.3368 5.0514 4.9699 4.8035 5.1399 3.8601 4.7737 1.6254 4.7260 11.7406 1.3906 1.4567 1.2443 1.4547 2.4336 2.0972 10.9207 1.3018 1.3895 1.3984 1.3988 2.5148 2.3504 3.2404 1.4264 4.3203 2.2856 4.6715 2.4540 1.5999 2.2207 5.3410 1.2638 1.3125 1.7980 1.4010 1.7102 1.6082 1.7301 1.0698 1.1424 9.0742 3.0223 1.8246 3.1711 1.4940 1.5220 1.9336 1.2683 2.4646 1.8290 3.5879 10.4403 5.9688 3.8108 4.3836 1.2167 1.9200 2.1358 1.5734 1.2275 1.5569 1.3705 1.1819 1.6888 1.0605 1.5696 1.6117 6.7470 7.4561 6.6707 6.0197 6.0405 6.2498 8.6805 1.0614 1.0390 1.0315 1.0958 1.0947 1.1039 1.1002 1.0889 1.0862 1.0894 1.0901 1.1026 1.0927 1.0902 1.0961 1.0966 1.0954 1.0983 1.0943 1.0641
irintensity: 0.3070 0.4373 1.0973 2.9329 0.6057 0.3157 0.4038 0.4167 0.8840 3.7409 2.0038 2.0731 4.7957 0.8880 0.5231 3.6008 0.8926 0.5468 1.4273 2.5327 1.1623 6.4906 2.4761 0.6629 0.5769 1.5800 11.0017 2.3795 0.2516 2.9490 7.2227 14.9792 0.3678 3.8275 1.7317 13.3573 0.0240 4.3624 94.1543 21.3473 6.0317 88.7955 5.5091 29.1485 16.7396 2.5923 22.8789 71.9227 20.3872 5.4895 15.7735 0.4756 11.7892 15.1567 83.9148 4.9484 6.9749 2.4304 6.4926 9.8931 0.8702 2.3569 60.4992 17.5662 83.9195 37.2138 24.6844 0.6984 4.6079 23.0670 18.6338 68.2370 0.3127 4.8404 8.0357 0.8701 16.5002 1.1235 28.5610 20.6225 165.3522 28.3984 69.1575 25.6931 28.9862 19.1755 11.6767 2.3640 4.5833 36.2725 23.5555 26.1078 67.6745 22.5191 1.8374 16.3230 434.5309 8.2551 2.7031 53.8569 21.0177 0.6974 26.0331 2.7929 50.6536 6.3156 73.9777 8.1409 0.1779 15.3007 37.2086 17.5128 59.1327 11.8221 10.6293 93.1304 31.8853 19.7792 12.6104 55.8982 14.2489 10.2586 18.8437 10.5239 61.7360 2.5019 10.1779 12.3394 138.5723 269.6428 34.7964 22.3093 32.5242 25.2022 15.1784 21.0941 13.4021 10.2476 2.5876 7.2479 7.9444 22.2801 24.9448 11.0284 4.2309 6.4446 9.7899 10.4192 1.9279 52.7442
temp: 298.150 k
press: 1.00000 atm
elementType: 16 8 8 8 8 8 8 8 7 7 6 6 6 6 6 6 6 6 6 6 6 6 6 6 6 6 6 6 6 6 6 6 1 1 1 1 1 1 1 1 1 1 1 1 1 1 1 1 1 1 1 1
symmnumber: 1
zpe: 998405.2 jmol-1
zpe.correction: 0.380272 hartree
zpe.thermalcorrener: 0.410463 hartree
zpe.thermalcorrenthalpy: 0.411407 hartree
zpe.thermalcorrgfe: 0.314600 hartree
zpe.sumelectzpe: -1881.908484 hartree
zpe.sumelectthermal: -1881.878293 hartree
zpe.sumelectthermalent: -1881.877349 hartree
zpe.sumelectthermalfe: -1881.974156 hartree
dipole: -11.9312 -0.7230 4.1483
dipole: 12.6524
quadrupole: -225.5778 -169.6897 -194.0452
quadrupole: 31.0924 -20.5532 3.4163
quadrupole: -29.1402 26.7479 2.3924 31.0924 -20.5532 3.4163
hfenergy: -1882.2887564 hartree
pointgroup: C01 [X(C22H20N2O7S1)]
dipole: 4.6955381 -0.3581126 -1.6132891 debye
polarizability: 396.7894699|-14.7338007|301.4715445|-7.7175007|-16.0658973|275.8025479 unknown
InChI: InChI=1S/C22H20N2O7S/c1-15-7-10-17(11-8-15)32(29,30)23(19-6-4-3-5-18(19)22(25)26)14-16-9-12-20(24(27)28)21(13-16)31-2/h3-13,25H,14H2,1-2H3
charge 0 multiplicity 1
52 atoms
S  1.642018 1.443239 0.846302
O  1.320103 1.432128 2.440113
O  1.663763 2.795686 -0.051221
O  -4.873958 0.323447 0.474872
O  -0.171338 3.716518 -2.378699
O  -1.452399 2.652703 -0.771489
O  -5.814613 -3.721018 0.467136
O  -6.568798 -1.660298 1.080684
N  0.234565 0.33033 0.049429
N  -5.618655 -2.470189 0.764273
C  -0.028432 -0.841034 0.90976
C  0.366763 0.209102 -1.361104
C  -1.497033 -1.25017 0.813719
C  3.284054 0.555339 0.575641
C  0.085661 1.34653 -2.189322
C  0.803164 -0.997784 -1.976787
C  -2.490863 -0.262166 0.66466
C  -1.858979 -2.616299 0.917463
C  3.756076 -0.289596 1.593934
C  3.970311 0.777873 -0.630042
C  -3.867873 -0.607137 0.643597
C  0.319747 1.263745 -3.584886
C  5.72062 -0.76546 0.17706
C  4.985629 -0.949997 1.379084
C  5.196637 0.103618 -0.817673
C  -3.215392 -2.977509 0.885024
C  -4.221151 -1.991671 0.762386
C  0.973015 -1.079523 -3.372197
C  0.753825 0.060858 -4.17975
C  -0.567322 2.584099 -1.657298
C  7.05792 -1.453237 -0.023613
C  -4.493438 1.745865 0.352208
H  0.179604 -0.5115 1.948077
H  0.625226 -1.715896 0.703592
H  1.011373 -1.876663 -1.359249
H  -2.171564 0.776604 0.534337
H  -1.089447 -3.388424 1.024825
H  3.197805 -0.401183 2.529281
H  3.572824 1.46924 -1.379755
H  0.129252 2.148325 -4.198682
H  5.382493 -1.609822 2.158971
H  5.755325 0.260031 -1.747404
H  -3.532782 -4.021529 0.95062
H  1.293935 -2.023418 -3.82596
H  0.905665 0.009808 -5.262672
H  7.253591 -1.659761 -1.08994
H  7.884246 -0.814472 0.343779
H  7.111623 -2.407438 0.528099
H  -5.450156 2.267517 0.211016
H  -3.998232 2.097827 1.275457
H  -3.823653 1.91413 -0.50842
H  -0.628158 4.513132 -1.995934
