program: Gaussian 09
title: 000276337
version: EM64L-G09RevD.01
frameworkgroup: C1[X(C9H18Cl3O3P)]
method: RPBEPBE
basis: SDD
operation: Freq
keyword: #p
keyword: freq=noraman
keyword: PBEPBE/SDD
title: #p freq=noraman PBEPBE/SDD
converged: YES YES NO NO
title: Mulliken charges:
elementType: Cl Cl Cl P O O O C C C C C C C C C H H H H H H H H H H H H H H H H H H
charge: 0.003210 -0.096382 -0.081747 1.322774 -0.504566 -0.524623 -0.605894 -0.362615 -0.314739 -0.271277 -0.308462 -0.304911 -0.349498 -0.820612 -0.598587 -0.583452 0.222631 0.217992 0.223398 0.227355 0.229914 0.221325 0.232388 0.228218 0.214205 0.235899 0.229364 0.211801 0.310216 0.325518 0.277116 0.256446 0.271708 0.265887
chargesum: 0.00000
title: Mulliken charges with hydrogens summed into heavy atoms:
elementType: Cl Cl Cl P O O O C C C C C C C C C
charge: 0.003210 -0.096382 -0.081747 1.322774 -0.504566 -0.524623 -0.605894 0.078008 0.136014 0.179962 0.152144 0.145192 0.091667 -0.184878 -0.065025 -0.045857
polarizability: 1.74310756e+02 -3.32504254e+00 1.74513922e+02 5.78040605e+00 -7.30773552e+00 1.22491073e+02
1716.lowfreq: -6.4378 -5.5993 -5.3380 -0.0025 -0.0015 0.0015 15.3831 24.1060 28.4455
frequency: 14.7701 24.0131 28.2313 36.7549 42.5961 46.6469 58.6762 74.9178 83.6732 95.9674 110.7588 130.6879 142.2137 181.7779 192.2589 203.7450 225.2169 235.4548 246.0500 264.9072 309.9370 339.4255 368.8278 399.7119 439.0228 474.7040 501.1260 589.6834 592.7371 593.1676 643.1699 678.7011 734.1877 762.4807 773.7657 817.7453 822.6892 824.9743 887.1830 892.2109 928.3539 940.1420 991.7132 997.7397 1036.9529 1046.3810 1052.9561 1059.4133 1071.4066 1099.0692 1114.5355 1131.7651 1148.8754 1165.6039 1190.2556 1191.8205 1229.8132 1231.1750 1260.4276 1269.5673 1275.7087 1300.2372 1301.9952 1305.8021 1319.3524 1358.3320 1360.1909 1373.4151 1377.2636 1395.5579 1441.1537 1449.0118 1450.5823 1450.9055 1454.4399 1458.6524 1475.2296 1477.5742 2963.5840 2976.2493 2983.8364 2990.0570 2992.8217 3001.5605 3032.1248 3032.9913 3045.0991 3052.4578 3054.6776 3063.8927 3064.9587 3074.4800 3090.5955 3136.1210 3137.4684 3167.9103
redmass: 7.3510 8.8169 5.4744 7.2106 4.2300 4.4385 5.3622 4.5191 5.0386 2.7492 5.9669 4.4506 3.3953 5.6180 3.6993 4.6833 2.4226 2.2757 2.5951 3.1945 5.8416 5.2191 4.8254 6.7492 3.2178 4.7136 3.0844 5.4628 4.3171 4.3008 8.7969 5.0362 4.3383 1.1564 1.6627 1.8548 1.4236 1.5880 4.4018 1.5128 1.3580 6.2641 2.4217 2.2356 3.0558 3.6922 1.6437 1.3884 2.7313 2.1320 2.1177 1.2127 1.2942 1.3601 1.3167 1.2912 1.1967 1.1986 1.2251 1.1948 1.1639 1.1412 1.1555 1.1674 1.2737 1.2945 1.2536 1.5675 1.5166 1.0734 1.0745 1.0815 1.1018 1.1006 1.0903 1.0818 1.0867 1.0907 1.0634 1.0553 1.0601 1.0632 1.0605 1.0619 1.0920 1.0957 1.1024 1.0697 1.0612 1.0976 1.0987 1.0547 1.1062 1.1113 1.1114 1.1111
irintensity: 0.5737 1.1198 0.9188 0.9998 4.6134 2.2784 4.8757 2.3385 0.2288 1.4568 2.9107 0.5077 1.6555 13.9356 1.9847 1.2249 0.7059 3.1699 0.9633 1.9235 41.4246 8.4961 16.9202 11.4100 3.1655 27.3065 7.6497 11.2389 47.7363 0.8044 150.8399 61.0886 15.6073 15.1055 22.9377 1.1579 6.2467 7.6242 227.3596 12.4794 1.6124 175.1939 38.3613 17.0169 98.0147 37.5422 7.2008 1.5045 17.0222 2.3848 0.5671 27.2578 1.8040 1.7600 3.2964 12.2771 0.5812 3.5922 5.4984 17.9270 4.5874 5.0095 8.6492 16.6881 5.6936 6.0197 5.8714 3.6921 7.3557 14.9174 3.0115 7.4856 7.0240 4.5925 22.6015 16.5366 4.7280 15.0065 20.9284 26.2069 9.5701 9.5205 24.1805 48.8043 15.1326 3.0988 15.5932 16.5180 23.4019 8.3732 48.9557 3.3297 28.2834 14.6703 16.4364 0.1442
temp: 298.150 k
press: 1.00000 atm
elementType: 17 17 17 15 8 8 8 6 6 6 6 6 6 6 6 6 1 1 1 1 1 1 1 1 1 1 1 1 1 1 1 1 1 1
symmnumber: 1
zpe: 699390.9 jmol-1
zpe.correction: 0.266384 hartree
zpe.thermalcorrener: 0.287512 hartree
zpe.thermalcorrenthalpy: 0.288457 hartree
zpe.thermalcorrgfe: 0.210619 hartree
zpe.sumelectzpe: -2299.506602 hartree
zpe.sumelectthermal: -2299.485473 hartree
zpe.sumelectthermalent: -2299.484529 hartree
zpe.sumelectthermalfe: -2299.562367 hartree
dipole: 0.5953 -3.2395 -2.1003
dipole: 3.9064
quadrupole: -141.3185 -120.2034 -128.2426
quadrupole: 12.0940 -17.2997 3.8468
quadrupole: -11.3970 9.7181 1.6789 12.0940 -17.2997 3.8468
hfenergy: -2299.7729857 hartree
pointgroup: C01 [X(C9H18Cl3O3P1)]
dipole: 1.3286545 -0.2912022 0.7155138 debye
polarizability: 171.8347168|-3.6399773|175.7431718|-11.8196248|2.1631755|123.7378619 unknown
InChI: InChI=1S/C9H18Cl3O3P/c10-5-1-3-7-14-16(13,9-12)15-8-4-2-6-11/h1-9H2
charge 0 multiplicity 1
34 atoms
Cl -2.081315 -4.241236 0.471213
Cl -3.399307 3.918546 0.462053
Cl 1.933333 3.788507 -0.396004
P  0.23039 -2.218527 -0.015139
O  -1.031095 -1.078408 -0.338762
O  1.233971 -1.477609 1.211613
O  0.987396 -2.647745 -1.342976
C  -2.559851 0.723456 0.214336
C  2.120693 0.527094 -0.005034
C  -1.83752 -0.498684 0.781277
C  2.460235 -0.762549 0.755074
C  -1.586467 1.842052 -0.209127
C  3.386524 1.347244 -0.336906
C  -0.464875 -3.566078 1.10266
C  -2.261336 3.070814 -0.808689
C  3.115121 2.553958 -1.234601
H  -3.252802 1.106525 0.989417
H  -3.177336 0.405842 -0.647507
H  1.434748 1.142895 0.603405
H  1.592912 0.267895 -0.94411
H  -2.557699 -1.26563 1.125502
H  -1.161116 -0.214869 1.611985
H  3.059973 -1.44896 0.126465
H  2.998631 -0.556364 1.695882
H  -0.962016 2.152539 0.65076
H  -0.894569 1.442171 -0.977324
H  3.885812 1.680497 0.59302
H  4.114946 0.708041 -0.881817
H  -0.633566 -3.154983 2.106895
H  0.258009 -4.393004 1.129223
H  -1.534334 3.846839 -1.09058
H  -2.922784 2.827762 -1.654883
H  4.022536 3.141105 -1.439625
H  2.611256 2.277365 -2.173593
