program: Gaussian 09
title: 000276332
version: EM64L-G09RevD.01
frameworkgroup: C1[X(C12H18O2)]
method: RPBEPBE
basis: SDD
operation: Freq
keyword: #pfreq=noraman
keyword: PBEPBE/SDD
title: #p freq=noraman PBEPBE/SDD
converged: YES YES NO NO
title: Mulliken charges:
elementType: O O C C C C C C C C C C C C H H H H H H H H H H H H H H H H H H
charge: -0.427515 -0.427517 -0.212095 -0.212089 0.430360 0.430358 0.027295 0.027278 -0.534581 -0.534581 -0.722002 -0.675187 -0.675191 -0.722002 0.183297 0.183302 0.256549 0.256551 0.211854 0.217589 0.230780 0.223186 0.212932 0.226915 0.226922 0.212936 0.223169 0.230784 0.217591 0.211850 0.350630 0.350633
chargesum: 0.00000
title: Mulliken charges with hydrogens summed into heavy atoms:
elementType: O O C C C C C C C C C C C C
charge: -0.076885 -0.076884 -0.028798 -0.028787 0.430360 0.430358 0.027295 0.027278 -0.278032 -0.278030 -0.061780 -0.012154 -0.012164 -0.061777
polarizability: 1.85880331e+02 -2.54993098e+00 1.38031348e+02 3.74699954e+00 -2.74833292e+00 9.16965521e+01
1716.lowfreq: -14.0356 -7.0719 -0.0008 -0.0008 -0.0007 13.6802 41.8072 66.5983 68.3215
frequency: 41.8072 66.5983 68.2635 144.5542 147.1378 163.3014 188.8481 218.3184 228.6779 252.7965 265.3532 271.6596 272.1915 294.1210 303.3663 316.4829 319.9715 371.4898 392.1614 443.2921 454.6098 469.6121 478.5911 533.8627 591.8542 615.6800 686.8187 718.7496 739.1002 788.1867 866.8939 874.8901 882.9740 893.6477 915.4823 915.7350 960.2164 960.7564 1007.7896 1069.4122 1091.9277 1097.9799 1118.6629 1124.5528 1150.5744 1155.9731 1165.3038 1175.7642 1224.2501 1259.3662 1282.8316 1283.4438 1319.4519 1326.0527 1340.7839 1377.8550 1378.0511 1390.1765 1397.1929 1397.2739 1446.6725 1464.3555 1464.5706 1471.3224 1471.4035 1480.7756 1482.0411 1490.7728 1491.2090 1498.3176 1576.6784 1650.6207 2894.4492 2894.5177 2974.3470 2974.5238 2981.4912 2981.5964 3070.6101 3070.6368 3072.8905 3072.9854 3079.2322 3079.3037 3084.9051 3084.9200 3167.1471 3170.0383 3581.7986 3582.8120
redmass: 2.9946 3.0388 3.2657 2.9224 2.9976 5.4567 1.6834 1.1294 1.5609 1.7893 1.0412 1.4049 2.0633 1.1806 1.7369 4.2848 2.4144 2.6558 2.7881 4.5041 2.9271 6.0879 2.7754 3.4408 3.2566 4.1116 5.4872 5.2118 2.8482 3.8415 2.8186 1.5740 1.5675 2.0568 1.1842 1.1863 1.4381 1.4361 2.5581 1.4693 1.8381 2.6092 2.3543 2.0002 1.5564 1.3423 2.4059 2.0554 1.7964 1.4439 1.4573 1.3735 2.5210 1.8506 1.6340 1.1935 1.1926 2.6270 1.3170 1.2035 3.3004 1.0628 1.0473 1.0500 1.1342 1.1202 1.0449 1.1273 1.0587 2.3981 7.2106 7.1483 1.0818 1.0820 1.0349 1.0349 1.0356 1.0356 1.1004 1.1004 1.0998 1.0997 1.0995 1.0995 1.1002 1.1001 1.0903 1.0910 1.0652 1.0654
irintensity: 0.0154 0.6789 0.0000 0.0000 1.2778 1.2998 0.0000 0.2515 0.0000 0.0000 0.2678 0.0328 87.4527 0.0034 113.7239 0.0001 50.9754 10.3674 0.0000 0.0000 4.7311 0.0000 9.0340 0.0000 0.0000 0.4922 0.7770 0.0000 0.0000 102.8582 0.0000 0.0000 26.2952 19.6104 12.3701 0.0040 0.0000 4.1394 0.0000 21.6409 0.0000 24.0456 0.0000 20.7839 227.0455 0.0001 46.1228 0.0000 68.4553 0.0000 31.0746 0.0000 0.0001 78.5509 0.0000 30.8765 0.0024 62.1801 44.7179 0.0947 20.7606 15.7970 0.0002 0.0021 11.1564 20.2741 0.0001 16.2041 0.0002 112.8860 0.0000 0.0000 78.2179 1.7538 70.5678 0.0131 53.3988 0.0108 40.1830 12.0204 40.7366 0.0842 125.7964 0.1635 59.0365 14.4476 8.6942 0.0000 48.9678 0.0281
temp: 298.150 k
press: 1.00000 atm
elementType: 8 8 6 6 6 6 6 6 6 6 6 6 6 6 1 1 1 1 1 1 1 1 1 1 1 1 1 1 1 1 1 1
symmnumber: 1
zpe: 712135.0 jmol-1
zpe.correction: 0.271238 hartree
zpe.thermalcorrener: 0.287004 hartree
zpe.thermalcorrenthalpy: 0.287948 hartree
zpe.thermalcorrgfe: 0.229437 hartree
zpe.sumelectzpe: -617.437630 hartree
zpe.sumelectthermal: -617.421864 hartree
zpe.sumelectthermalent: -617.420920 hartree
zpe.sumelectthermalfe: -617.479431 hartree
dipole: -0.0002 0.0001 0.0006
dipole: 0.0006
quadrupole: -66.6985 -92.8444 -87.7793
quadrupole: -1.9425 3.0966 -0.6751
quadrupole: 15.7423 -10.4037 -5.3386 -1.9425 3.0966 -0.6751
hfenergy: -617.7088683 hartree
pointgroup: C01 [X(C12H18O2)]
dipole: 0.0000784 0.0001003 0.000215 debye
polarizability: 185.8744585|-3.9538389|126.3047302|0.399539|-20.460304|103.4290419 unknown
InChI: InChI=1S/C12H18O2/c1-7(2)9-5-12(14)10(8(3)4)6-11(9)13/h5-8,13-14H,1-4H3
charge 0 multiplicity 1
32 atoms
O  -1.275398 2.300249 -0.998004
O  1.275385 -2.300421 0.998266
C  -2.970501 0.150179 0.146705
C  2.970532 -0.150276 -0.146348
C  -1.440127 0.067921 0.101736
C  1.440153 -0.068018 -0.101335
C  -0.680078 1.125843 -0.47523
C  0.680105 -1.125936 0.47562
C  -0.723512 -1.054353 0.574198
C  0.723533 1.054257 -0.573814
C  -3.616428 -0.780583 1.197281
C  -3.571448 -0.128461 -1.263796
C  3.571531 0.128503 1.264111
C  3.61642 0.78039 -1.197027
H  -3.254337 1.188928 0.439729
H  3.25435 -1.189052 -0.439287
H  -1.243607 -1.899856 1.032461
H  1.243631 1.899746 -1.032098
H  -3.469426 -1.844153 0.933307
H  -4.705781 -0.600651 1.24612
H  -3.191847 -0.614019 2.203295
H  -3.138359 0.530429 -2.038772
H  -4.668437 0.012618 -1.259066
H  -3.35985 -1.171481 -1.561427
H  3.359882 1.171523 1.561697
H  4.66853 -0.012506 1.259347
H  3.13853 -0.530357 2.039166
H  3.191709 0.61381 -2.202981
H  4.705752 0.600363 -1.245975
H  3.469541 1.843987 -0.933084
H  -2.245777 2.311538 -0.807836
H  2.24583 -2.311557 0.808442
