program: Gaussian 09
title: 000276315
version: EM64L-G09RevD.01
frameworkgroup: C1[X(C14H14N2O2)]
method: RPBEPBE
basis: SDD
operation: Freq
keyword: #p
keyword: freq=noraman
keyword: PBEPBE/SDD
title: #p freq=noraman PBEPBE/SDD
converged: NO YES NO NO
title: Mulliken charges:
elementType: O O N N C C C C C C C C C C C C C C H H H H H H H H H H H H H H
charge: -0.302772 -0.281702 -0.255148 0.011643 -0.488912 -0.363820 0.292280 -0.151387 -0.394114 0.456435 -0.068744 0.251151 -0.408942 -0.327186 -0.250925 -0.232275 -0.209888 -0.674168 0.253272 0.253270 0.249484 0.249465 0.308166 0.236951 0.260609 0.227701 0.229952 0.228917 0.228920 0.214113 0.228826 0.228829
chargesum: 0.00000
title: Mulliken charges with hydrogens summed into heavy atoms:
elementType: O O N N C C C C C C C C C C C C C C
charge: -0.302772 -0.281702 -0.255148 0.011643 0.017630 0.135129 0.292280 -0.151387 -0.085949 0.456435 -0.068744 0.251151 -0.171991 -0.066577 -0.023224 -0.002323 0.247948 -0.002400
polarizability: 2.98514695e+02 1.86496192e+01 1.75416661e+02 1.91945183e-02 -4.07856830e-03 8.29241650e+01
1716.lowfreq: -4.0432 -0.0007 -0.0004 0.0003 1.8017 2.6274 26.1332 46.5350 52.4062
frequency: 26.1001 46.4851 52.3994 79.7527 96.3359 114.1930 132.1459 174.2235 193.6353 251.5602 272.6826 282.5634 295.7357 335.6087 364.9221 408.2229 424.3095 450.5373 482.8341 533.5001 553.6635 578.3239 606.4433 678.3485 695.7137 705.0302 720.0559 745.2460 766.3694 792.0295 796.1397 799.9982 825.5961 827.8843 875.8275 886.6562 926.3551 959.5246 966.8398 992.2830 1003.2450 1019.2616 1033.3656 1043.3432 1089.3149 1109.7297 1117.0242 1138.2334 1138.4615 1166.4833 1174.3386 1201.9371 1218.4783 1226.2363 1249.2085 1259.8559 1262.2014 1295.9416 1312.0171 1354.4983 1371.2151 1392.4492 1400.2441 1411.4352 1442.6354 1459.4259 1463.2764 1467.4427 1475.6602 1489.4859 1491.5965 1512.4236 1566.3284 1609.5154 1620.4538 1631.2794 2995.4026 3010.1027 3016.3428 3031.2564 3065.4924 3068.6495 3090.8320 3092.5237 3106.9262 3122.3499 3136.4414 3153.0994 3168.4164 3181.9812
redmass: 3.1300 2.2118 2.6734 4.1280 3.5844 3.4978 3.8702 4.9617 4.6034 1.2359 3.6580 5.1919 5.5121 4.8811 3.8371 5.1896 4.6240 6.1706 2.9368 6.5805 3.7621 6.0519 7.3495 3.8880 6.2099 6.9230 6.9716 6.7246 1.3267 2.4611 4.8820 1.0964 3.7202 1.4394 1.5217 5.9078 1.5075 4.0429 1.3905 1.3262 2.6874 2.1569 2.8512 1.7518 3.9963 2.4790 2.4308 2.8571 1.4599 1.1573 1.1943 1.6509 1.0705 2.4092 1.1328 2.9247 1.7533 2.3139 1.8644 1.5996 1.8656 3.9714 1.3069 3.3019 2.9309 1.6011 1.0406 2.1596 1.0579 1.0812 1.1772 3.7436 8.9307 8.2081 6.6522 10.9778 1.0357 1.0581 1.0596 1.0609 1.1048 1.1068 1.1059 1.0985 1.1028 1.0865 1.0893 1.0948 1.0998 1.0936
irintensity: 0.4769 1.2421 0.3701 0.4191 4.6896 0.0223 5.0363 5.2104 1.9060 1.5540 2.3852 1.6667 10.0342 0.0710 11.2235 0.1376 0.1877 4.0810 9.2108 5.7023 0.4729 3.3094 8.6141 0.2730 21.4704 0.2540 3.1871 2.7183 67.6357 6.8978 5.7207 3.5275 0.6341 3.2077 8.0685 2.9436 27.1006 111.2199 10.3349 0.0014 2.0516 10.1152 169.0780 1.7363 260.1304 1.4824 27.4064 15.9771 5.2753 6.9979 0.2236 1.1811 0.2250 35.4547 0.0000 137.9931 19.0807 289.0227 126.6387 21.8211 58.6826 34.1870 16.4605 14.6254 333.4366 14.7873 12.7555 74.7066 4.2716 11.5365 18.4652 32.1581 7.7679 239.1896 12.5543 156.7684 23.4314 24.3265 10.1045 41.5286 0.2408 6.7644 24.0561 31.1122 46.5886 1.8355 9.1607 25.1212 30.9696 0.3025
temp: 298.150 k
press: 1.00000 atm
elementType: 8 8 7 7 6 6 6 6 6 6 6 6 6 6 6 6 6 6 1 1 1 1 1 1 1 1 1 1 1 1 1 1
symmnumber: 1
zpe: 664967.8 jmol-1
zpe.correction: 0.253273 hartree
zpe.thermalcorrener: 0.268868 hartree
zpe.thermalcorrenthalpy: 0.269812 hartree
zpe.thermalcorrgfe: 0.208882 hartree
zpe.sumelectzpe: -800.584777 hartree
zpe.sumelectthermal: -800.569182 hartree
zpe.sumelectthermalent: -800.568238 hartree
zpe.sumelectthermalfe: -800.629167 hartree
dipole: 2.8159 0.8057 0.0009
dipole: 2.9289
quadrupole: -83.9297 -102.0972 -106.7868
quadrupole: 7.2007 0.0020 -0.0009
quadrupole: 13.6749 -4.4926 -9.1822 7.2007 0.0020 -0.0009
hfenergy: -800.8380496 hartree
pointgroup: C01 [X(C14H14N2O2)]
dipole: 1.1078707 -0.3170114 -0.0003653 debye
polarizability: 298.5139497|-18.6520788|175.417406|-0.0191946|-0.0040782|82.924165 unknown
InChI: InChI=1S/C14H14N2O2/c1-2-18-14(17)16-8-7-12-13(16)9-10-5-3-4-6-11(10)15-12/h3-6,9H,2,7-8H2,1H3
charge 0 multiplicity 1
32 atoms
O  3.774975 0.09457 -0.000681
O  2.207549 1.855657 -0.000153
N  1.545903 -0.40409 -0.000367
N  -1.812821 -1.713578 0.000208
C  0.554149 -2.618149 0.0003
C  1.91475 -1.859556 -0.000814
C  0.142821 -0.225042 -0.000172
C  -0.495481 -1.517734 0.000065
C  -0.628702 0.935392 -0.000196
C  -2.056977 0.770567 -0.000038
C  -2.617657 -0.568881 0.000143
C  2.473358 0.623884 -0.000467
C  -2.950728 1.889778 -0.000068
C  -4.034952 -0.738594 0.000281
C  -4.335664 1.696319 0.000071
C  -4.882724 0.37481 0.000246
C  4.86454 1.11616 -0.000635
C  6.183492 0.350018 -0.000879
H  0.440057 -3.26288 0.888901
H  0.439282 -3.264224 -0.887207
H  2.52748 -2.081292 0.888574
H  2.525813 -2.08112 -0.891415
H  -0.170687 1.926915 -0.000326
H  -2.530759 2.902879 -0.000205
H  -4.422984 -1.76201 0.000419
H  -5.009763 2.560116 0.000046
H  -5.969718 0.238486 0.000356
H  4.745561 1.753604 -0.895282
H  4.74574 1.753347 0.894217
H  7.027188 1.064025 -0.000888
H  6.269585 -0.288998 0.894626
H  6.269378 -0.288779 -0.896559
