program: Gaussian 09
title: 000276314
version: EM64L-G09RevD.01
frameworkgroup: C1[X(C10H15NO5)]
method: RPBEPBE
basis: SDD
operation: Freq
keyword: #p
keyword: freq=noraman
keyword: PBEPBE/SDD
title: #p freq=noraman PBEPBE/SDD
converged: YES YES NO NO
title: Mulliken charges:
elementType: O O O O O N C C C C C C C C C C H H H H H H H H H H H H H H H
charge: -0.252015 -0.146266 -0.309919 -0.233444 -0.295949 -0.169638 -0.324113 -0.417352 -0.421113 0.121974 0.259446 0.318502 -0.261533 -0.249179 -0.662744 -0.664691 0.308094 0.269949 0.271097 0.266406 0.277105 0.230995 0.238278 0.236913 0.219873 0.221128 0.250201 0.228350 0.216968 0.222454 0.250221
chargesum: 0.00000
title: Mulliken charges with hydrogens summed into heavy atoms:
elementType: O O O O O N C C C C C C C C C C
charge: -0.252015 -0.146266 -0.309919 -0.233444 -0.295949 -0.169638 -0.016019 0.123694 0.122399 0.121974 0.259446 0.318502 0.207741 0.207608 0.036935 0.024952
polarizability: 1.80977096e+02 -6.09360039e-01 1.18657318e+02 -1.84249196e+00 9.11264393e-01 9.60360054e+01
1716.lowfreq: -5.2511 -2.7362 -0.0004 -0.0001 0.0007 2.8573 22.0126 32.5985 41.5442
frequency: 22.0026 32.4747 41.2509 58.4238 69.4159 80.6129 93.3948 121.2520 131.3206 163.5675 180.1250 214.1686 225.0615 238.1108 242.9184 310.1091 314.6840 377.0297 399.9235 424.2324 456.6200 489.3609 535.8807 592.5368 642.9894 681.4002 695.9332 705.8155 760.8184 781.9991 800.4270 814.6691 817.4784 860.9630 915.5332 939.6532 995.2029 1007.6215 1021.2016 1059.4780 1080.5358 1094.3516 1096.0322 1101.6288 1128.9708 1150.8964 1157.9656 1159.6392 1176.3359 1219.1943 1230.0817 1276.2980 1280.5074 1282.3073 1285.6248 1343.4370 1351.0327 1357.5913 1388.0367 1390.9985 1391.3210 1452.3039 1458.3380 1458.8015 1464.0349 1464.0780 1484.8308 1484.9235 1496.2313 1633.0900 1651.1822 1682.5598 2972.5900 2991.0341 2994.5139 2999.7148 3024.2138 3029.3580 3035.3413 3052.2240 3085.9605 3089.8036 3091.2404 3097.0837 3098.3495 3117.3162 3124.1676
redmass: 4.1951 4.5122 3.3389 3.3499 3.7665 4.7896 4.3639 3.6719 4.0452 5.4097 2.1292 2.1420 1.4359 3.6076 1.6844 2.6174 3.1079 4.6460 7.0511 3.4437 3.6577 4.4669 5.4896 3.2264 5.0408 4.9562 10.3966 4.7297 2.8386 2.2489 2.3482 1.5138 1.8183 3.4124 2.0241 2.4367 2.6512 2.5875 1.9965 5.0671 3.9543 2.2995 2.1512 2.7151 2.7233 1.4713 1.4621 1.6849 1.7600 2.6980 1.3355 1.1370 1.4040 1.2555 1.6350 1.4630 1.4669 1.3936 1.5351 1.2737 1.9241 1.0876 1.1013 1.0960 1.0481 1.0457 1.0531 1.0522 1.0785 8.8755 10.3890 12.5018 1.0659 1.0360 1.0360 1.0673 1.0816 1.0595 1.0599 1.0940 1.0975 1.0973 1.1031 1.1027 1.0991 1.1060 1.1068
irintensity: 0.9415 1.3811 0.7500 1.1409 2.7664 4.1410 5.3468 0.6487 0.6081 1.6810 1.3079 6.8099 7.0549 3.8564 1.9276 9.7647 31.3644 8.5292 3.9709 4.1554 1.5047 6.2606 0.2810 9.0364 10.6077 17.3989 19.2921 3.3555 15.4766 5.5473 5.1315 5.4494 1.1325 38.1060 17.6918 4.6844 2.5036 104.7633 4.4919 122.6907 189.5201 133.8749 2.0406 111.7434 71.2903 205.8649 32.2382 49.0447 13.7646 38.6289 24.1792 7.7040 156.2294 82.0395 97.3434 9.9636 32.8149 26.1625 98.7178 14.1647 67.1477 38.5956 34.3211 13.2915 18.6441 13.9214 22.4102 8.7492 15.9302 161.1268 408.2624 197.4489 28.5623 20.3466 18.1323 11.4169 3.9442 35.0199 23.8773 5.1144 39.2535 33.0871 2.2314 2.1670 4.2898 32.7035 28.4801
temp: 298.150 k
press: 1.00000 atm
elementType: 8 8 8 8 8 7 6 6 6 6 6 6 6 6 6 6 1 1 1 1 1 1 1 1 1 1 1 1 1 1 1
symmnumber: 1
zpe: 644737.7 jmol-1
zpe.correction: 0.245568 hartree
zpe.thermalcorrener: 0.262953 hartree
zpe.thermalcorrenthalpy: 0.263897 hartree
zpe.thermalcorrgfe: 0.197728 hartree
zpe.sumelectzpe: -819.700510 hartree
zpe.sumelectthermal: -819.683124 hartree
zpe.sumelectthermalent: -819.682180 hartree
zpe.sumelectthermalfe: -819.748349 hartree
dipole: -0.0641 0.2537 1.6344
dipole: 1.6552
quadrupole: -70.2601 -105.8955 -95.8673
quadrupole: 10.5087 -3.5870 -2.8391
quadrupole: 20.4142 -15.2212 -5.1930 10.5087 -3.5870 -2.8391
hfenergy: -819.9460773 hartree
pointgroup: C01 [X(C10H15N1O5)]
dipole: 0.0385345 0.3669026 -0.5366206 debye
polarizability: 181.0134728|-0.4800345|115.1241161|-0.6583063|8.2711633|99.5328305 unknown
InChI: InChI=1S/C10H15NO5/c1-3-15-9(13)7-5-11(6-8(7)12)10(14)16-4-2/h7H,3-6H2,1-2H3
charge 0 multiplicity 1
31 atoms
O  3.32894 0.13285 -0.401079
O  1.145306 2.09119 1.245589
O  -3.566533 0.080922 0.643158
O  2.600043 -1.333544 1.267288
O  -2.853441 -1.898572 -0.437809
N  -1.333911 -0.347464 0.437483
C  0.973826 -0.043389 -0.060854
C  -0.121187 -1.123673 0.081738
C  -1.024959 0.907846 1.126946
C  0.465171 1.133009 0.833579
C  2.360486 -0.510317 0.353787
C  -2.595697 -0.819771 0.160449
C  4.758905 -0.156191 -0.04956
C  -4.980133 -0.287901 0.338584
C  5.254484 -1.402441 -0.786666
C  -5.388591 0.197417 -1.054955
H  1.026309 0.353107 -1.092326
H  -0.306659 -1.6932 -0.841675
H  0.152969 -1.834928 0.884443
H  -1.176853 0.852364 2.224675
H  -1.637553 1.749102 0.757095
H  5.286619 0.756419 -0.367547
H  4.829099 -0.277136 1.045298
H  -5.082251 -1.383823 0.425466
H  -5.553294 0.211636 1.136346
H  6.331563 -1.547982 -0.58322
H  4.71629 -2.302059 -0.444492
H  5.121833 -1.295968 -1.877064
H  -6.461322 -0.012725 -1.223754
H  -5.230641 1.285212 -1.157309
H  -4.809216 -0.32619 -1.833917
