program: Gaussian 09
title: 000281559
version: EM64L-G09RevD.01
frameworkgroup: C1[X(C19H16N2O5)]
method: RPBEPBE
basis: SDD
operation: Freq
keyword: #p
keyword: freq=noraman
keyword: PBEPBE/SDD
title: #p freq=noraman PBEPBE/SDD
converged: YES YES NO NO
title: Mulliken charges:
elementType: O O O O O N N C C C C C C C C C C C C C C C C C C C H H H H H H H H H H H H H H H H
charge: -0.157976 -0.248626 -0.448339 -0.208577 -0.320800 -0.453071 -0.408448 0.037613 0.319012 0.252348 0.200431 0.352216 -0.323612 -0.598079 -0.456809 -0.123821 -0.347059 -0.374475 -0.426589 0.219338 -0.225852 -0.271291 -0.232960 0.181320 0.284264 -0.771203 0.278559 0.275838 0.299027 0.282113 0.334307 0.304295 0.272619 0.281658 0.236900 0.240030 0.237618 0.366195 0.256034 0.222213 0.262728 0.400913
chargesum: 0.00000
title: Mulliken charges with hydrogens summed into heavy atoms:
elementType: O O O O O N N C C C C C C C C C C C C C C C C C C C
charge: -0.157976 -0.248626 -0.047426 -0.208577 -0.320800 -0.118764 -0.042253 0.037613 0.319012 0.252348 0.200431 0.352216 -0.323612 -0.043682 -0.174696 0.175205 -0.042764 -0.101856 -0.144931 0.219338 0.011048 -0.031261 0.004658 0.181320 0.284264 -0.030227
polarizability: 3.24333882e+02 3.22344860e+01 2.78415165e+02 -1.80857883e+01 2.38883619e+01 1.40142027e+02
1716.lowfreq: -4.8420 -0.0002 0.0006 0.0009 3.5014 3.5774 19.0787 26.1149 42.3992
frequency: 19.0160 26.1048 42.3875 55.0691 63.4971 68.7027 83.0295 91.0301 98.2436 105.1871 126.4532 151.6283 155.1602 170.8694 197.2921 232.0659 244.7128 271.4962 279.2285 293.3363 314.3049 349.8001 358.4936 408.5123 412.6298 418.8539 444.8441 500.5447 513.3199 516.6143 536.1774 551.5026 559.5938 562.8305 583.3070 599.0011 620.7714 630.8768 645.4576 661.3422 673.9822 679.4090 706.5618 715.2525 753.0302 763.4441 777.9412 786.8947 802.4555 838.6976 850.0536 858.1815 892.4437 905.7702 930.9948 947.4649 954.4999 965.8389 972.4080 990.2446 998.7424 1000.2689 1000.9687 1013.2377 1037.8368 1045.4050 1071.4345 1080.4725 1089.4595 1138.3090 1166.9695 1172.8945 1180.1050 1190.4347 1212.8131 1223.2535 1231.5464 1246.6118 1254.7611 1294.3889 1307.1063 1309.4542 1330.5200 1347.7667 1366.3689 1392.6834 1403.5149 1419.5958 1449.8746 1450.6639 1457.5824 1464.4369 1466.8819 1476.1107 1492.1924 1512.7658 1588.4079 1589.1998 1596.2615 1606.5870 1614.8672 1625.2287 1633.8698 1680.5285 2986.7456 2999.7694 3036.2364 3096.2923 3107.0528 3110.3225 3120.9801 3138.1815 3145.3010 3150.8536 3165.5775 3167.5849 3191.4095 3532.7790 3534.3710 3543.0141
redmass: 6.0785 6.0601 6.1008 8.2783 5.7555 5.0798 9.9607 1.6253 3.2330 3.2344 4.1502 4.8911 5.9889 5.0049 6.0912 5.3237 5.7516 7.8494 8.8536 5.7176 4.5707 3.5563 4.1302 3.7277 4.3275 4.0980 4.1402 4.1293 4.5217 3.4216 4.8938 3.6725 5.8152 3.7897 1.8477 2.9599 5.7361 3.8926 1.7480 3.0346 1.8534 2.7632 2.1442 5.0261 1.5238 5.9672 3.8537 1.6993 2.5185 5.5868 5.9206 2.6511 4.6193 1.5395 5.1916 1.4406 2.8288 4.0331 1.4805 5.9513 1.3643 1.5303 1.4323 3.3933 2.2691 1.6563 1.8828 1.6992 2.4587 3.9967 1.5220 1.8370 1.4334 1.3895 2.0151 1.2519 1.5683 2.8817 1.8110 2.2545 1.5168 1.8690 2.0137 1.4672 5.5639 1.2262 2.7639 2.7637 1.7567 1.3306 1.1929 1.1402 3.3977 2.9745 2.0915 2.2532 6.4377 5.5256 6.9737 7.4702 7.9488 4.0499 9.3735 9.6123 1.0820 1.0360 1.0610 1.0977 1.1015 1.1030 1.0907 1.0879 1.0879 1.0935 1.0962 1.1001 1.0951 1.0767 1.0781 1.0648
irintensity: 0.8503 0.7809 0.6353 5.1736 10.9619 11.2081 6.7952 0.7289 8.7616 1.5471 1.4750 2.4653 1.6178 4.8416 0.4627 4.9259 6.4483 2.4923 3.5284 4.4514 2.3282 2.4042 1.0598 2.3905 2.1129 0.3770 4.9901 27.4546 36.0055 39.5413 12.0995 21.0170 0.2098 2.7626 21.9228 60.8410 12.0482 15.1252 4.5126 73.5459 109.2532 29.8245 31.0936 11.6082 136.7656 2.6359 4.1922 2.1934 15.2508 2.7569 17.3756 33.6808 5.6203 2.2665 14.2438 0.2563 12.1205 30.8071 10.4716 5.3006 4.1791 0.7809 0.4875 63.8299 9.7750 17.1420 197.9954 22.3093 14.1154 10.7392 27.2333 10.3044 4.8932 17.2259 10.1635 7.5442 4.0791 20.8013 39.9703 83.8182 20.5730 30.6887 17.8284 11.1648 62.7870 54.3227 69.0069 114.2112 18.4939 7.8738 37.3802 63.0294 84.6768 7.2574 177.9212 474.4862 31.1671 80.9326 44.1136 214.1534 18.3077 178.9080 95.1553 240.8876 16.1335 5.9986 5.0901 5.8646 15.0288 2.8155 10.2926 1.1182 5.6474 4.0802 16.9104 23.5924 6.5883 13.3499 95.0111 64.3822
temp: 298.150 k
press: 1.00000 atm
elementType: 8 8 8 8 8 7 7 6 6 6 6 6 6 6 6 6 6 6 6 6 6 6 6 6 6 6 1 1 1 1 1 1 1 1 1 1 1 1 1 1 1 1
symmnumber: 1
zpe: 831331.1 jmol-1
zpe.correction: 0.316637 hartree
zpe.thermalcorrener: 0.339615 hartree
zpe.thermalcorrenthalpy: 0.340560 hartree
zpe.thermalcorrgfe: 0.262373 hartree
zpe.sumelectzpe: -1217.473307 hartree
zpe.sumelectthermal: -1217.450329 hartree
zpe.sumelectthermalent: -1217.449385 hartree
zpe.sumelectthermalfe: -1217.527571 hartree
dipole: 3.8893 -2.9287 2.2764
dipole: 5.3746
quadrupole: -163.8883 -142.9449 -145.7422
quadrupole: 3.9832 16.6349 1.3583
quadrupole: -13.0298 7.9136 5.1163 3.9832 16.6349 1.3583
hfenergy: -1217.7899441 hartree
pointgroup: C01 [X(C19H16N2O5)]
dipole: 1.5672037 -1.09389 0.9047136 debye
polarizability: 322.0806934|33.6953073|280.9146308|-18.1403715|23.1534537|139.8957502 unknown
InChI: InChI=1S/C19H16N2O5/c1-10(22)20-15(19(25)26)9-16(23)21-14-8-4-7-13-17(14)11-5-2-3-6-12(11)18(13)24/h2-8,15,20-21,25H,9H2,1H3
charge 0 multiplicity 1
42 atoms
O  -5.320125 0.970601 0.54375
O  2.396823 2.122181 -0.287725
O  5.15142 0.701532 1.27122
O  5.704108 0.961887 -0.973414
O  1.732167 -2.445082 -0.153663
N  0.609427 0.632103 -0.679533
N  3.255419 -1.030742 0.882192
C  -1.773485 0.720074 -0.08215
C  -2.221295 -0.696427 -0.278266
C  -2.912622 1.501336 0.281633
C  -3.639351 -0.741625 -0.08221
C  -0.515514 1.363863 -0.20803
C  -4.133161 0.626067 0.283626
C  2.870007 0.006061 -1.406376
C  -2.83592 2.870061 0.569051
C  3.88273 -0.577345 -0.369296
C  -0.423925 2.757276 0.102184
C  -1.535411 -1.897331 -0.5615
C  -4.377251 -1.927418 -0.197977
C  1.943942 1.028325 -0.743979
C  -1.563907 3.490351 0.488763
C  -2.282346 -3.101827 -0.681232
C  -3.68579 -3.124902 -0.513251
C  4.990553 0.443478 -0.095168
C  2.232669 -1.952803 0.914516
C  1.727589 -2.346357 2.295326
H  3.454583 0.520036 -2.189454
H  2.318246 -0.832966 -1.855786
H  4.371152 -1.43815 -0.870547
H  -3.737018 3.426154 0.845257
H  0.423721 -0.319456 -1.004221
H  0.551626 3.242188 0.03413
H  -0.445919 -1.976958 -0.65022
H  -5.460765 -1.913637 -0.039507
H  -1.455261 4.555812 0.716677
H  -1.746584 -4.032049 -0.899901
H  -4.232559 -4.068302 -0.613987
H  3.616516 -0.618059 1.746072
H  1.878675 -3.430701 2.437547
H  2.225817 -1.805699 3.117304
H  0.641104 -2.16032 2.349406
H  5.844618 1.400767 1.406341
