program: Gaussian 09
title: 000281562
version: EM64L-G09RevD.01
frameworkgroup: C1[X(C30H24N2O4)]
method: RPBEPBE
basis: SDD
operation: Freq
keyword: #p
keyword: freq=noraman
keyword: PBEPBE/SDD
title: #p freq=noraman PBEPBE/SDD
converged: YES YES NO NO
title: Mulliken charges:
elementType: O O O O N N C C C C C C C C C C C C C C C C C C C C C C C C C C C C C C H H H H H H H H H H H H H H H H H H H H H H H H
charge: -0.288021 -0.288015 -0.233128 -0.233142 -0.450545 -0.450604 -0.701124 -0.701123 0.316519 0.316491 0.186364 0.186398 0.298916 0.298896 0.200298 0.200275 -0.600600 -0.600629 0.521906 0.521903 -0.383245 -0.383265 -0.530388 -0.530369 -0.383922 -0.383911 -0.476413 -0.476375 0.345490 0.345467 -0.413899 -0.413900 0.265560 0.265580 -0.759938 -0.759936 0.246771 0.249740 0.246765 0.249745 0.270977 0.270996 0.236000 0.236004 0.312834 0.312853 0.240778 0.240778 0.221498 0.221496 0.299089 0.299119 0.252859 0.252857 0.249109 0.248840 0.257685 0.249075 0.248875 0.257688
chargesum: 0.00000
title: Mulliken charges with hydrogens summed into heavy atoms:
elementType: O O O O N N C C C C C C C C C C C C C C C C C C C C C C C C C C C C C C
charge: -0.288021 -0.288015 -0.233128 -0.233142 -0.151456 -0.151486 -0.204613 -0.204613 0.316519 0.316491 0.186364 0.186398 0.298916 0.298896 0.200298 0.200275 -0.329624 -0.329633 0.521906 0.521903 -0.147245 -0.147261 -0.217554 -0.217516 -0.143144 -0.143133 -0.254915 -0.254879 0.345490 0.345467 -0.161040 -0.161043 0.265560 0.265580 -0.004303 -0.004298
polarizability: 5.51176099e+02 6.75703055e-02 3.88921497e+02 2.66746928e+01 6.10021823e-02 3.11747528e+02
1716.lowfreq: -61.9909 -61.4857 -7.2137 -5.7984 -4.3005 -2.4081 -0.0011 0.0005 0.0010
frequency: -61.9905 -61.4854 -6.8340 4.1615 15.8177 27.6335 32.7503 33.8131 39.1414 70.3082 70.5403 83.2767 95.1771 131.6479 131.7380 153.5274 155.6616 166.8677 184.4265 214.0925 215.9787 235.3203 236.8429 267.7408 269.8884 276.0366 279.1858 282.7558 318.7502 337.6265 361.2276 392.4171 393.4567 412.7401 424.4507 424.4709 431.2736 440.1277 440.1473 469.3250 493.4258 507.2473 515.7770 533.2960 534.7363 541.8014 552.2316 554.5992 564.6810 566.7186 596.8848 600.9139 607.8445 621.0021 627.7209 646.4896 663.9177 708.2319 711.0463 716.7187 718.5098 733.7228 734.5231 759.9684 761.0763 767.2656 768.1109 814.6154 815.3829 834.3146 834.3663 848.9181 848.9380 867.7088 875.8125 909.6021 911.6731 927.4626 927.7925 940.2204 941.6141 942.0117 942.0721 955.3986 955.4704 969.1524 969.8216 992.3442 993.0220 1001.9940 1002.1379 1043.9835 1044.0111 1093.9354 1094.6786 1112.8595 1116.3983 1121.7547 1133.3198 1133.6966 1134.5617 1134.8022 1152.4497 1176.2963 1177.5945 1196.4538 1198.1298 1198.3779 1202.9837 1203.5514 1235.2526 1248.3626 1271.4900 1284.3701 1285.0096 1298.4624 1306.6630 1346.9913 1366.4249 1369.9081 1377.7345 1380.3171 1384.0780 1384.3565 1424.5880 1424.9263 1435.1608 1436.9314 1448.4668 1452.2098 1454.2833 1454.4474 1458.4524 1458.4869 1459.2785 1461.0586 1476.8059 1489.2757 1498.0906 1506.1126 1588.5502 1591.8484 1593.4412 1595.7271 1614.3171 1614.3695 1628.6640 1639.0379 1642.6268 1642.6402 2985.1951 2985.2250 3007.4810 3007.4866 3029.6315 3029.6729 3094.0286 3094.0334 3113.7540 3113.7770 3137.1217 3137.1385 3142.3439 3142.4279 3142.6340 3142.6799 3152.1489 3153.0895 3168.9783 3168.9935 3199.1505 3199.1783 3501.7947 3512.7746
redmass: 1.0475 1.0465 4.6984 7.0554 6.7245 6.6078 5.0635 4.6684 4.4347 5.2057 5.1133 5.5485 5.6002 4.3768 4.7067 6.4416 5.4492 5.2956 6.0228 6.8928 6.8709 2.0491 2.1219 2.1435 4.7028 1.7330 6.4279 4.1412 6.4784 6.1802 5.0601 5.1410 5.2894 4.8072 2.7919 2.7326 4.7970 3.0847 3.1344 1.2331 4.7272 3.9250 4.4717 3.0687 4.8090 2.7373 6.0851 5.9539 3.3876 3.2722 3.7468 3.8941 2.6470 6.1594 6.6842 6.5871 5.9155 3.3261 3.1703 6.3104 6.2155 5.7271 5.8168 3.3669 3.3997 5.5630 5.5324 1.4786 1.4908 1.5607 1.5603 6.2772 6.2666 1.4549 1.4791 1.4398 1.4191 4.4927 4.4354 3.0156 2.5249 1.4896 1.3872 1.4015 1.3980 1.9337 1.9319 5.3601 5.0730 1.9961 1.9554 1.5977 1.5976 2.1725 2.1258 1.9944 1.9315 2.0105 1.4705 1.4269 1.1482 1.1501 1.4721 3.9719 3.9416 2.0441 2.6228 2.6210 1.5922 1.8066 2.1141 1.9177 1.7665 1.3994 1.3914 2.0732 3.2121 3.1749 4.0191 3.7128 4.9533 4.0261 1.2746 1.3795 1.1526 1.1471 3.7284 4.3491 2.6066 2.0028 1.0776 1.1402 1.0460 1.0460 5.3887 3.3516 2.3674 3.3746 1.8149 2.9081 6.8147 7.4501 7.3448 5.6254 7.3238 7.3865 7.4873 6.9786 10.6568 10.6934 1.0610 1.0610 1.0366 1.0366 1.0992 1.0993 1.0972 1.0972 1.0873 1.0873 1.0895 1.0895 1.0956 1.0956 1.1009 1.1009 1.0916 1.0914 1.0957 1.0957 1.0932 1.0932 1.0775 1.0770
irintensity: 1.1810 1.1613 2.0760 0.0296 0.9396 0.3544 2.2293 2.3054 0.0574 1.6148 1.3847 0.0238 1.7363 0.3147 0.4892 3.1186 15.1916 0.8880 0.0506 0.5198 1.8640 20.1716 8.2188 31.8512 2.7155 71.5718 2.3818 1.7954 13.4988 6.3677 0.0021 5.3283 0.7147 5.9962 6.2066 11.6559 2.3101 1.7828 0.1981 128.1524 0.5141 0.0634 1.9471 5.6933 27.1946 17.4393 0.5272 1.3241 0.6094 0.5015 12.2684 11.5394 7.9804 1.3500 0.3722 5.3834 11.8345 8.1638 13.7743 0.0042 9.3685 0.8790 0.2438 0.1970 0.0190 0.4495 1.2376 79.7834 69.5838 24.4196 21.2005 24.3987 20.3838 33.8526 12.8288 0.9147 2.6705 31.6929 25.2172 3.3662 31.6164 12.8479 1.2651 4.8884 4.1648 25.5733 20.9643 15.5499 15.2203 87.0400 68.0797 9.6731 9.1851 2.3916 2.9588 63.5992 168.9316 61.5109 16.6337 0.3292 0.0397 0.0123 14.7492 738.1923 621.1815 24.7049 5.8292 10.1059 42.8477 9.8305 140.8917 78.2750 71.6260 5.2956 34.6395 2.7393 92.6985 4.1321 20.2026 2.1997 5.5995 8.7306 60.5906 38.9586 2.2205 27.9919 61.1924 68.5982 0.0267 241.3809 0.7165 19.4579 18.5631 18.1891 141.1187 145.4109 41.5588 84.6488 5.0110 0.8128 13.7172 10.9599 0.3653 31.8620 3.1260 0.1549 420.0135 111.5123 133.3767 279.3276 3.1518 17.6508 7.7457 6.5073 6.6648 5.8568 6.8332 6.6751 19.6477 24.1484 6.0696 5.4628 41.9677 15.7220 7.3878 7.6893 14.7105 1.1133 20.9963 0.9686 3.3069 3.2745 15.6425 160.1173
temp: 298.150 k
press: 1.00000 atm
elementType: 8 8 8 8 7 7 6 6 6 6 6 6 6 6 6 6 6 6 6 6 6 6 6 6 6 6 6 6 6 6 6 6 6 6 6 6 1 1 1 1 1 1 1 1 1 1 1 1 1 1 1 1 1 1 1 1 1 1 1 1
symmnumber: 1
zpe: 1212477.7 jmol-1
zpe.correction: 0.461808 hartree
zpe.thermalcorrener: 0.490864 hartree
zpe.thermalcorrenthalpy: 0.491809 hartree
zpe.thermalcorrgfe: 0.398005 hartree
zpe.sumelectzpe: -1565.532751 hartree
zpe.sumelectthermal: -1565.503695 hartree
zpe.sumelectthermalent: -1565.502751 hartree
zpe.sumelectthermalfe: -1565.596554 hartree
dipole: -0.0052 -2.7223 0.0035
dipole: 2.7223
quadrupole: -186.0314 -185.0194 -200.3036
quadrupole: 0.0302 18.5332 0.0101
quadrupole: 4.4201 5.4320 -9.8522 0.0302 18.5332 0.0101
hfenergy: -1565.9945593 hartree
pointgroup: C01 [X(C30H24N2O4)]
dipole: -0.0027364 -1.071021 -0.0016068 debye
polarizability: 551.4081871|-0.1077866|388.9206151|25.6108008|0.2620082|311.5163222 unknown
InChI: InChI=1S/C30H24N2O4/c1-17(33)35-25-5-9-29-21(15-25)11-19-13-23(3-7-27(19)29)31-32-24-4-8-28-20(14-24)12-22-16-26(36-18(2)34)6-10-30(22)28/h3-10,13-16,31-32H,11-12H2,1-2H3
charge 0 multiplicity 1
60 atoms
O  7.787339 2.528304 0.042467
O  -7.78406 2.538903 -0.028933
O  7.166882 3.321128 -2.089361
O  -7.160091 3.321699 2.10557
N  0.408605 -3.9087 0.546206
N  -0.414038 -3.905245 -0.567515
C  3.582257 -0.24868 -1.07105
C  -3.581562 -0.24826 1.068393
C  3.00827 -1.317202 -0.146578
C  -3.009773 -1.31349 0.138774
C  3.804837 -1.413089 1.035661
C  -3.807576 -1.403285 -1.04311
C  4.793964 0.259659 -0.296617
C  -4.793357 0.264902 0.297316
C  4.905987 -0.440996 0.943072
C  -4.907457 -0.43024 -0.945286
C  1.878472 -2.126307 -0.334409
C  -1.880845 -2.124837 0.322051
C  1.530625 -3.060795 0.681544
C  -1.535148 -3.055409 -0.698215
C  3.45434 -2.341623 2.041784
C  -3.459212 -2.327949 -2.053522
C  5.710101 1.257847 -0.669237
C  -5.707795 1.262654 0.67517
C  5.961699 -0.13368 1.832545
C  -5.963651 -0.117664 -1.832375
C  2.323421 -3.162427 1.862988
C  -2.329195 -3.150987 -1.879325
C  6.76055 1.546536 0.240031
C  -6.758743 1.556667 -0.231797
C  6.889723 0.865085 1.474284
C  -6.890005 0.880756 -1.468866
C  7.924912 3.34523 -1.095704
C  -7.919615 3.35066 1.113181
C  9.126803 4.251033 -0.929019
C  -9.120968 4.258198 0.95212
H  3.869297 -0.664878 -2.056552
H  2.852528 0.559901 -1.271888
H  -3.868196 -0.668362 2.052358
H  -2.850651 0.55855 1.272047
H  1.257428 -2.044461 -1.231647
H  -1.258896 -2.047563 1.219066
H  4.050535 -2.433641 2.956618
H  -4.056386 -2.415313 -2.968171
H  5.628728 1.795206 -1.614547
H  -5.62486 1.795846 1.622698
H  6.067626 -0.656778 2.78898
H  -6.071208 -0.636433 -2.790985
H  2.046851 -3.890002 2.636644
H  -2.054317 -3.875637 -2.656321
H  0.14914 -4.520528 1.323082
H  -0.156099 -4.51428 -1.347072
H  7.720831 1.133606 2.133192
H  -7.721403 1.153209 -2.125793
H  8.800428 5.30356 -0.996736
H  9.833122 4.073936 -1.758851
H  9.63149 4.079535 0.03184
H  -8.795631 5.309813 1.03599
H  -9.831804 4.069394 1.775574
H  -9.620642 4.099025 -0.013467
