program: Gaussian 09
title: 000275519
version: EM64L-G09RevD.01
frameworkgroup: C1[X(C26H28O4)]
method: RPBEPBE
basis: SDD
operation: Freq
keyword: #pfreq=noraman
keyword: PBEPBE/SDD
title: #p freq=noraman PBEPBE/SDD
converged: YES YES NO NO
title: Mulliken charges:
elementType: O O O O C C C C C C C C C C C C C C C C C C C C C C C C C C H H H H H H H H H H H H H H H H H H H H H H H H H H H H
charge: -0.332553 -0.332568 -0.150578 -0.150551 -0.561865 -0.561869 -0.357983 -0.357974 0.501897 0.501905 0.300533 0.300726 0.167276 0.167407 -0.339846 -0.339851 -0.411464 -0.411460 -0.414030 -0.414053 -0.061601 -0.061609 -0.361781 -0.361828 -0.455444 -0.455821 -0.092530 -0.092461 -0.694200 -0.694197 0.206113 0.208938 0.208974 0.206074 0.205902 0.204476 0.205890 0.204486 0.196345 0.196044 0.196357 0.196034 0.236238 0.236244 0.238271 0.238278 0.260269 0.260318 0.286666 0.286814 0.211828 0.211537 0.218246 0.211832 0.211533 0.218248 0.383206 0.383213
chargesum: 0.00000
title: Mulliken charges with hydrogens summed into heavy atoms:
elementType: O O O O C C C C C C C C C C C C C C C C C C C C C C C C C C
charge: 0.050653 0.050645 -0.150578 -0.150551 -0.146814 -0.146822 0.052394 0.052401 0.501897 0.501905 0.300533 0.300726 0.167276 0.167407 0.052543 0.052540 -0.175226 -0.175216 -0.175759 -0.175774 -0.061601 -0.061609 -0.101512 -0.101510 -0.168778 -0.169007 -0.092530 -0.092461 -0.052588 -0.052585
polarizability: 5.27890467e+02 -2.90633090e+01 2.70071555e+02 -3.02601934e-03 9.00999725e-03 1.98178084e+02
1716.lowfreq: -2.0490 -0.0015 0.0013 0.0019 3.5627 8.5156 10.7707 13.2459 20.6354
frequency: 8.4262 12.8213 20.6182 23.1260 41.0754 48.4135 61.7317 69.3947 80.3261 80.8479 82.7032 85.8621 95.5335 110.3793 110.5989 148.6246 149.2256 154.2093 190.2092 190.8468 217.3904 229.3838 230.1377 272.1497 285.0539 286.1585 326.4694 334.3776 347.4471 354.2444 363.9799 367.6456 391.1217 403.3415 404.4842 405.7209 412.6645 425.5096 451.2746 490.5306 492.7460 531.1260 545.9524 580.1044 600.3148 602.5085 628.0097 631.1346 636.2465 658.8699 720.5788 730.7129 735.7406 735.8220 757.1130 770.1120 776.6806 790.7439 791.0549 796.7873 819.4722 835.9565 845.6869 857.6994 857.8346 859.5431 862.8085 901.7228 902.3372 921.0553 921.2755 958.2630 964.8324 975.9398 981.5525 981.7375 1007.5725 1007.6629 1012.8121 1014.8858 1067.7537 1067.7972 1069.0144 1070.0000 1079.3665 1104.9530 1105.0139 1126.0808 1133.6377 1135.5385 1166.9184 1196.1294 1199.5649 1206.4185 1206.4608 1217.8231 1222.1389 1222.5449 1255.1190 1255.1403 1271.5838 1271.5937 1287.4595 1287.5422 1294.9115 1311.1737 1312.4901 1319.6646 1319.7405 1333.1616 1345.0214 1345.0344 1355.7448 1365.9219 1369.0321 1376.6900 1390.0653 1390.0685 1411.9855 1416.3453 1466.9610 1466.9982 1471.8145 1471.8616 1477.3402 1477.3841 1481.7306 1481.7591 1490.2436 1490.3010 1501.9964 1503.3046 1535.8882 1546.5282 1559.0829 1564.2112 1569.4689 1602.4340 1617.8006 1618.5361 2963.2859 2963.2938 2970.1989 2970.2032 2973.7538 2973.7769 2981.2427 2981.2863 3002.9735 3002.9792 3023.1148 3023.1152 3047.7400 3047.7442 3070.7978 3070.7991 3073.4547 3073.4722 3110.8507 3110.9000 3125.1208 3125.1817 3135.5688 3135.6211 3172.4431 3172.4585 3427.7986 3428.4498
redmass: 4.3438 4.3741 3.9291 4.4526 5.0528 4.3356 3.7656 4.9929 4.5044 1.7899 6.1962 1.8673 4.0994 2.3040 2.3407 5.8219 4.8895 5.8891 4.8425 4.0649 5.4107 1.1126 1.1136 4.3449 4.3303 4.4833 3.3118 5.0223 3.9394 6.4218 8.1022 3.0666 5.8324 3.1977 3.3723 2.9201 4.5283 4.8326 6.9814 4.6272 10.3361 3.3231 2.5606 1.3128 4.6028 1.6419 3.5222 5.2662 6.4895 4.8999 4.4521 4.0585 1.0733 1.0733 10.0598 3.6919 4.8228 1.1761 1.2005 4.5643 3.4680 2.3939 1.8613 1.4687 2.9823 1.5680 3.4766 1.7525 1.7423 1.2478 1.2393 1.8042 1.3402 2.5799 1.3430 1.3659 4.0510 4.0641 3.2696 2.9424 2.5519 2.4705 1.4196 1.4299 3.0454 2.1877 2.1931 2.2039 1.3184 1.6974 3.4652 1.2194 1.1295 1.4977 1.4959 2.4211 2.1977 2.1376 1.3984 1.3980 1.2320 1.2321 1.0704 1.0705 2.6415 1.3915 1.3617 1.4232 1.4296 5.9963 1.5636 1.5635 2.2085 3.2280 4.6181 4.4874 1.2125 1.2125 3.0909 3.1854 1.0747 1.0746 1.0754 1.0754 1.0422 1.0422 1.0747 1.0747 1.0947 1.0948 2.7435 2.6603 11.7216 10.1966 8.9968 6.4792 7.3865 9.8187 6.3030 6.3434 1.0585 1.0585 1.0592 1.0592 1.0368 1.0368 1.0591 1.0592 1.0990 1.0990 1.1024 1.1024 1.1046 1.1046 1.1009 1.1009 1.0993 1.0993 1.0872 1.0872 1.0900 1.0900 1.0962 1.0962 1.0950 1.0950 1.0646 1.0645
irintensity: 0.2600 0.0684 0.2503 0.1783 0.8747 1.2107 0.1744 0.1346 0.1264 0.0043 3.0900 0.0445 0.0624 0.0185 0.0235 1.0143 0.0791 0.6091 0.5349 0.0075 1.1722 0.0101 0.0161 0.0160 0.2802 6.3081 3.0386 0.0166 4.4985 0.0015 14.7505 0.0736 0.0888 0.1368 0.6667 0.8270 0.3577 0.8711 10.5452 0.4568 0.0661 19.8122 28.0325 153.4880 3.4595 8.1059 12.7413 16.1545 0.8141 12.3505 1.0836 2.7954 7.0484 7.0523 6.8566 0.1241 36.7350 1.5102 1.5184 1.8594 75.0256 4.1240 26.0020 3.2884 1.8001 0.6068 10.2256 4.4258 2.7405 2.1632 0.4911 43.7780 0.5040 39.1438 2.3810 6.1589 1.9350 0.0293 21.8231 0.0042 5.2246 0.1905 2.1173 11.4223 238.2860 63.5651 0.3053 0.0058 19.1229 15.3162 0.0615 96.7094 0.0988 1.9507 0.9833 234.0848 0.0145 18.5808 2.8599 4.6529 0.0624 0.1830 1.2647 1.2576 0.4923 21.1906 0.0528 2.8881 1.6406 189.4035 0.2725 0.1205 15.2008 0.3913 12.3455 0.0844 11.9243 11.6485 9.8229 4.4199 0.1330 0.2158 0.9891 1.0832 12.8970 12.8950 2.5156 2.6929 19.1972 18.1832 190.5942 0.1069 0.0301 292.4800 102.9405 0.3174 52.6931 0.6247 0.1429 28.7185 11.1683 9.3852 16.0463 11.3178 54.0078 27.2900 122.2381 55.3058 1.8495 1.8577 3.1132 2.2362 36.4925 36.9800 84.2047 83.4150 111.1708 5.9409 22.4992 0.4520 31.6680 11.9259 14.4295 13.2990 2.6211 3.4880 0.3038 174.4135
temp: 298.150 k
press: 1.00000 atm
elementType: 8 8 8 8 6 6 6 6 6 6 6 6 6 6 6 6 6 6 6 6 6 6 6 6 6 6 6 6 6 6 1 1 1 1 1 1 1 1 1 1 1 1 1 1 1 1 1 1 1 1 1 1 1 1 1 1 1 1
symmnumber: 1
zpe: 1239349.0 jmol-1
zpe.correction: 0.472043 hartree
zpe.thermalcorrener: 0.501810 hartree
zpe.thermalcorrenthalpy: 0.502754 hartree
zpe.thermalcorrgfe: 0.406657 hartree
zpe.sumelectzpe: -1306.272289 hartree
zpe.sumelectthermal: -1306.242523 hartree
zpe.sumelectthermalent: -1306.241579 hartree
zpe.sumelectthermalfe: -1306.337675 hartree
dipole: -0.0003 -0.0001 0.3839
dipole: 0.3839
quadrupole: -117.7754 -198.7706 -172.9148
quadrupole: 6.3561 0.0004 -0.0006
quadrupole: 45.3782 -35.6170 -9.7612 6.3561 0.0004 -0.0006
hfenergy: -1306.7443324 hartree
pointgroup: C01 [X(C26H28O4)]
dipole: -0.0001011 0.0004481 -0.1510452 debye
polarizability: 528.6892099|25.2605863|269.2722369|0.0987918|0.2018844|198.1786584 unknown
InChI: InChI=1S/C26H28O4/c1-3-5-7-17-9-13-19(14-10-17)21-23(27)25(29)22(26(30)24(21)28)20-15-11-18(12-16-20)8-6-4-2/h9-16,27,30H,3-8H2,1-2H3
charge 0 multiplicity 1
58 atoms
O  1.599778 -2.297705 0.26177
O  -1.60002 2.295192 0.274487
O  -1.071773 -2.520955 0.306779
O  1.071552 2.518206 0.321022
C  7.335067 0.630996 0.582906
C  -7.335371 -0.633792 0.578386
C  8.012499 -0.335332 -0.430449
C  -8.012335 0.337454 -0.430573
C  5.818816 0.536152 0.55711
C  -5.819084 -0.53933 0.553245
C  2.956941 0.295218 0.437484
C  -2.957166 -0.29847 0.435308
C  1.476144 0.140134 0.381161
C  -1.476354 -0.143247 0.379994
C  9.554632 -0.241224 -0.40173
C  -9.554551 0.244804 -0.401448
C  5.053261 1.293769 -0.368313
C  -5.053554 -1.29267 -0.375683
C  5.123653 -0.332698 1.435998
C  -5.123885 0.325142 1.436424
C  0.888306 -1.115723 0.33619
C  -0.888512 1.112821 0.342086
C  3.650173 1.181578 -0.430295
C  -3.650427 -1.180438 -0.43691
C  3.718678 -0.453103 1.382083
C  -3.718881 0.445472 1.383364
C  -0.606027 -1.340394 0.334963
C  0.605814 1.337504 0.342605
C  10.229531 -1.196225 -1.409616
C  -10.228939 1.204653 -1.405063
H  7.712801 0.398964 1.598052
H  7.655713 1.665534 0.350081
H  -7.656388 -1.667128 0.340799
H  -7.713123 -0.406246 1.594546
H  7.64521 -0.109656 -1.452046
H  7.698896 -1.375653 -0.208954
H  -7.645767 0.115707 -1.453287
H  -7.697617 1.376531 -0.204865
H  9.860303 0.803346 -0.616087
H  9.914488 -0.466237 0.623137
H  -9.861444 -0.79856 -0.619882
H  -9.913605 0.466043 0.624523
H  5.565242 1.990045 -1.043852
H  -5.565569 -1.985577 -1.054658
H  5.685796 -0.906927 2.182675
H  -5.68608 0.895933 2.185691
H  3.083448 1.788437 -1.141558
H  -3.083699 -1.783921 -1.151036
H  3.204678 -1.075349 2.125936
H  -3.204822 1.064154 2.130137
H  9.911374 -0.969984 -2.444771
H  9.961392 -2.248772 -1.199462
H  11.3311 -1.113672 -1.36918
H  -9.911687 0.982199 -2.441314
H  -9.959391 2.256023 -1.19084
H  -11.330583 1.12327 -1.364274
H  2.578399 -2.103687 0.22027
H  -2.578633 2.101393 0.231933
