program: Gaussian 09
title: 000275498
version: EM64L-G09RevD.01
frameworkgroup: C1[X(C15H14O2)]
method: RPBEPBE
basis: SDD
operation: Freq
keyword: #pfreq=noraman
keyword: PBEPBE/SDD
title: #p freq=noraman PBEPBE/SDD
converged: YES YES NO NO
title: Mulliken charges:
elementType: O O C C C C C C C C C C C C C C C H H H H H H H H H H H H H H
charge: -0.259919 -0.197972 0.175743 -0.479794 0.419549 -0.564644 -0.713605 0.189098 -0.582189 -0.404530 0.374743 0.379068 -0.414045 -0.431254 -0.408099 -0.243817 -0.242077 0.254332 0.230027 0.268093 0.254701 0.224467 0.252219 0.227590 0.235512 0.282447 0.238880 0.237424 0.240243 0.228699 0.229109
chargesum: 0.00000
title: Mulliken charges with hydrogens summed into heavy atoms:
elementType: O O C C C C C C C C C C C C C C C
charge: -0.259919 -0.197972 0.175743 0.004565 0.419549 -0.041850 -0.009328 0.189098 -0.346677 -0.122083 0.374743 0.379068 -0.175165 -0.193830 -0.167856 -0.015118 -0.012968
polarizability: 2.55370799e+02 8.68468562e+00 1.59053049e+02 5.66737377e+00 2.38552001e+00 9.25533077e+01
1716.lowfreq: -7.6120 -0.0005 -0.0005 0.0003 7.6971 11.9198 19.1514 51.1417 88.6964
frequency: 17.9471 50.9722 88.6712 126.0439 141.1279 181.1353 195.4988 239.0612 247.5764 267.7165 329.3093 345.5611 396.5754 418.0191 454.0747 478.4198 503.1088 513.0202 523.0418 549.5989 568.7547 626.3198 632.2120 672.4655 722.2149 758.2048 760.0523 782.2989 787.8430 808.6484 842.2641 858.2462 872.9755 895.7741 910.6550 914.1230 946.8367 956.7711 963.4432 988.9735 994.8391 1015.1324 1022.6569 1073.6881 1076.8101 1093.7426 1128.4633 1138.4692 1165.1407 1172.8692 1194.3737 1214.2784 1222.7689 1243.1550 1272.5710 1278.0938 1287.5457 1317.4958 1350.5133 1385.2460 1406.5191 1423.8080 1433.4902 1446.4216 1457.5703 1463.9107 1473.2495 1476.1173 1514.1721 1580.8512 1605.3126 1642.4756 1704.3746 2987.7279 3016.3235 3026.6681 3084.6725 3088.7245 3101.2643 3104.3840 3111.4819 3119.3071 3124.7454 3129.1610 3142.7168 3162.2520 3176.7725
redmass: 4.3055 5.6221 5.2644 4.3215 2.5049 3.7120 3.3946 1.0334 8.0538 3.1656 3.7499 2.9964 3.2666 4.6465 3.8388 2.5103 2.9691 6.6580 3.4842 4.0137 5.4281 5.6596 6.4277 2.8387 4.0351 1.3418 4.5745 3.5968 2.6736 2.2987 1.2986 5.2060 1.5198 3.3001 1.8422 1.9606 3.1984 2.0133 1.4027 1.3357 1.3617 2.1632 2.2758 2.0069 1.8705 3.5716 1.7020 1.8590 1.2290 1.0787 2.4271 1.5682 1.5914 1.7315 1.7455 1.6801 1.6678 1.7046 1.8080 1.2045 4.7438 3.3195 4.0547 1.0801 1.1083 1.6263 1.2727 1.1011 3.7046 7.2932 5.5861 6.7887 12.5861 1.0358 1.0647 1.0620 1.0998 1.1017 1.1001 1.1005 1.0910 1.0860 1.0889 1.0896 1.0948 1.1003 1.0945
irintensity: 2.8767 0.5169 3.7180 1.2278 1.3263 1.5889 0.5492 0.0012 1.3691 2.1894 0.6688 0.8621 0.4501 0.4841 2.0617 22.1618 2.7206 0.4699 3.9601 2.1367 2.8599 11.8015 1.5463 3.5589 3.3080 53.9678 0.9515 3.6742 3.2983 3.8736 27.9672 110.4244 52.7014 10.9212 9.6658 5.2462 6.6060 9.6574 5.9306 0.2237 0.2113 47.9261 3.0310 107.8491 6.5394 203.3675 3.7246 50.0140 0.7173 0.3539 37.7540 25.5548 8.6216 1.3896 6.1488 3.8352 14.0141 31.7246 8.1677 21.0007 0.8387 0.3768 0.7748 15.0961 11.5766 3.7555 2.2328 4.5383 16.8981 0.1640 7.5740 3.5471 415.3305 17.6644 13.9721 12.1304 45.5665 5.3485 13.2719 11.5600 17.5341 7.0581 0.6057 8.5519 33.3714 35.9591 3.0760
temp: 298.150 k
press: 1.00000 atm
elementType: 8 8 6 6 6 6 6 6 6 6 6 6 6 6 6 6 6 1 1 1 1 1 1 1 1 1 1 1 1 1 1
symmnumber: 1
zpe: 651892.3 jmol-1
zpe.correction: 0.248293 hartree
zpe.thermalcorrener: 0.262363 hartree
zpe.thermalcorrenthalpy: 0.263307 hartree
zpe.thermalcorrgfe: 0.206505 hartree
zpe.sumelectzpe: -729.265120 hartree
zpe.sumelectthermal: -729.251049 hartree
zpe.sumelectthermalent: -729.250105 hartree
zpe.sumelectthermalfe: -729.306907 hartree
dipole: -2.7013 -4.1136 0.5985
dipole: 4.9575
quadrupole: -106.6949 -92.6770 -101.6789
quadrupole: -17.1027 4.4826 2.1508
quadrupole: -6.3447 7.6733 -1.3286 -17.1027 4.4826 2.1508
hfenergy: -729.5134122 hartree
pointgroup: C01 [X(C15H14O2)]
dipole: 1.0831233 1.6041068 -0.2405861 debye
polarizability: 255.8623845|6.8309882|150.91808|-1.4195584|-21.5190685|100.1966908 unknown
InChI: InChI=1S/C15H14O2/c1-15(9-8-14(16)17-15)13-7-6-11-4-2-3-5-12(11)10-13/h2-7,10H,8-9H2,1H3
charge 0 multiplicity 1
31 atoms
O  -2.721955 -0.691585 0.310722
O  -4.757941 -1.387738 -0.55906
C  -1.82794 0.527386 0.222365
C  -2.270474 1.205705 -1.115262
C  -0.377157 0.048155 0.234102
C  -3.747095 0.790463 -1.276727
C  -2.140149 1.395093 1.461632
C  -3.856007 -0.537221 -0.517612
C  0.646617 0.907386 -0.18233
C  -0.044184 -1.26055 0.718599
C  2.021455 0.506797 -0.136882
C  2.351863 -0.816969 0.351115
C  1.285931 -1.678644 0.770352
C  3.082958 1.37514 -0.559685
C  3.727551 -1.220473 0.396077
C  4.413811 0.955443 -0.503652
C  4.73959 -0.353619 -0.021821
H  -1.666725 0.805356 -1.947475
H  -2.130735 2.298652 -1.078487
H  -4.064547 0.650619 -2.321778
H  -4.446304 1.511164 -0.813421
H  -3.184742 1.755825 1.443239
H  -1.991632 0.804828 2.381313
H  -1.463797 2.2672 1.497658
H  0.411398 1.913104 -0.555035
H  -0.854377 -1.926431 1.027147
H  1.529567 -2.683734 1.135048
H  2.834561 2.377751 -0.9288
H  3.973451 -2.223586 0.764738
H  5.216772 1.626273 -0.82838
H  5.787735 -0.66999 0.016204
