program: Gaussian 09
title: 000275510
version: EM64L-G09RevD.01
frameworkgroup: C1[X(C20H8Br4O5)]
method: RPBEPBE
basis: SDD
operation: Freq
keyword: #p
keyword: freq=noraman
keyword: PBEPBE/SDD
title: #p freq=noraman PBEPBE/SDD
converged: YES YES NO NO
title: Mulliken charges:
elementType: Br Br Br Br O O O O O C C C C C C C C C C C C C C C C C C C C H H H H H H H H
charge: 0.122856 0.118526 0.144962 0.146134 -0.262189 -0.412155 -0.247389 -0.383901 -0.173305 0.218592 0.202467 0.198483 0.294254 0.186970 0.206542 0.408760 -0.294491 -0.273810 -0.393497 -0.505134 -0.519214 -0.436212 -0.367606 0.319833 -0.361549 -0.172360 0.158075 -0.227389 -0.009014 0.246956 0.241957 0.293897 0.283745 0.231005 0.255403 0.365697 0.394102
chargesum: 0.00000
title: Mulliken charges with hydrogens summed into heavy atoms:
elementType: Br Br Br Br O O O O O C C C C C C C C C C C C C C C C C C C C
charge: 0.122856 0.118526 0.144962 0.146134 -0.262189 -0.046458 -0.247389 0.010200 -0.173305 0.218592 0.202467 0.198483 0.294254 0.186970 0.206542 0.408760 -0.047536 -0.031853 -0.393497 -0.211237 -0.235469 -0.205207 -0.367606 0.319833 -0.106147 -0.172360 0.158075 -0.227389 -0.009014
polarizability: 3.86469981e+02 -7.18641799e+00 2.90769121e+02 2.68649448e+01 -6.40936173e+01 3.75958882e+02
1716.lowfreq: -0.0005 -0.0004 0.0003 1.1648 1.8872 3.9439 13.2713 22.0739 31.6083
frequency: 13.1587 22.0658 31.6042 32.5990 43.5708 47.8033 60.0793 69.3946 86.6446 102.0163 114.5609 128.7799 137.5195 145.6328 147.8250 160.0958 176.8234 204.1929 209.3251 222.6022 233.2452 245.0507 259.1572 265.0106 309.0586 313.0362 332.3891 350.5939 391.4312 413.3774 422.9637 434.1504 446.8537 455.1325 474.8290 484.9654 515.6372 521.9827 575.9810 578.1796 595.3441 611.9449 619.8690 623.0672 627.0229 637.1743 647.4599 667.6758 706.6063 720.9120 732.6460 737.1643 758.4328 764.4535 770.0277 801.9292 819.0859 825.1331 866.1218 875.9925 887.1478 904.5125 934.7489 937.5248 958.3199 983.7106 1019.6534 1077.3549 1096.1025 1117.8796 1141.7420 1155.8660 1174.7165 1187.3796 1214.0131 1245.6998 1261.5845 1280.7140 1286.8456 1296.4981 1307.9265 1331.3548 1363.1548 1381.5492 1386.2946 1430.0640 1446.9814 1489.3235 1498.6651 1502.7957 1528.5142 1554.2806 1564.7663 1578.0846 1616.8620 1652.5435 1653.9318 3131.3609 3140.2332 3165.2338 3168.0942 3179.7684 3192.4006 3497.1249 3580.6923
redmass: 11.7669 15.7053 11.0557 13.3520 39.0315 14.9129 6.6281 9.9757 5.3543 11.5341 7.3398 12.4827 57.5610 27.1918 33.1411 11.4447 5.6257 32.6815 21.3064 15.8069 11.2608 6.4567 14.6793 7.0580 5.6365 8.0633 8.8055 11.0044 1.1212 5.3530 4.6527 4.1871 6.5958 3.2519 5.5769 9.0267 9.4849 7.7407 6.2800 3.4703 6.3456 3.7613 3.8010 8.9143 3.0600 6.2302 3.6010 4.8017 8.1768 3.6520 6.5481 7.9421 10.4218 3.3565 8.7559 1.6909 6.8825 1.7367 1.5378 1.7063 4.3852 5.1129 5.4436 1.3949 3.4304 1.3042 5.1192 3.1484 2.1286 2.7828 1.4956 1.6679 3.1635 2.0034 1.4630 2.1841 2.8999 3.2622 2.4288 3.8665 10.7356 5.0471 2.9227 3.1161 5.1905 7.3860 4.5171 6.5290 8.8666 4.6491 11.1876 7.7100 8.3747 8.0504 6.7045 10.1181 7.7299 1.0893 1.0873 1.0952 1.0979 1.0930 1.0934 1.0639 1.0662
irintensity: 1.1960 0.4890 0.8320 0.6097 0.0247 0.8269 0.3230 0.7024 1.7722 0.0458 2.2448 0.1643 0.5761 0.0890 0.0952 1.7465 3.0922 0.1404 0.1149 0.4286 0.9559 0.2056 0.4326 0.4920 0.4558 10.6992 0.1706 7.4272 131.4493 0.2011 0.9487 8.2318 12.8726 2.5305 6.5010 40.0524 35.0007 20.2286 3.9607 26.0827 6.1136 22.2049 25.6506 2.7221 62.4772 16.5192 32.8602 15.3907 5.8992 1.1939 8.3933 1.8482 6.7790 1.9138 4.7198 29.4529 9.1596 7.6743 21.3775 66.4713 26.8587 4.4328 5.8127 0.3161 30.1614 0.7557 154.0294 23.3719 286.3864 88.8384 124.0882 35.6313 39.9585 44.2671 31.7774 13.6318 99.9754 173.4332 37.4737 22.0838 1.1190 36.9002 16.0901 12.3604 148.4364 10.3181 18.2880 139.3173 78.7467 140.0229 26.0901 57.8386 69.2909 90.6219 435.2601 156.8614 45.6382 12.8861 4.9790 8.1014 10.7148 0.1929 1.2634 41.2807 119.2563
temp: 298.150 k
press: 1.00000 atm
elementType: 35 35 35 35 8 8 8 8 8 6 6 6 6 6 6 6 6 6 6 6 6 6 6 6 6 6 6 6 6 1 1 1 1 1 1 1 1
symmnumber: 1
zpe: 586716.8 jmol-1
zpe.correction: 0.223469 hartree
zpe.thermalcorrener: 0.250130 hartree
zpe.thermalcorrenthalpy: 0.251075 hartree
zpe.thermalcorrgfe: 0.161731 hartree
zpe.sumelectzpe: -1194.866912 hartree
zpe.sumelectthermal: -1194.840250 hartree
zpe.sumelectthermalent: -1194.839306 hartree
zpe.sumelectthermalfe: -1194.928649 hartree
dipole: 3.8195 -3.4576 8.3755
dipole: 9.8332
quadrupole: -222.1440 -202.4310 -201.2336
quadrupole: 12.4826 -32.3577 9.3828
quadrupole: -13.5412 6.1719 7.3693 12.4826 -32.3577 9.3828
hfenergy: -1195.0903801 hartree
pointgroup: C01 [X(C20H8Br4O5)]
dipole: 1.2032154 -3.6768205 0.0092687 debye
polarizability: 382.2558924|-24.9589407|413.4684486|1.9923293|13.9873828|257.4736427 unknown
InChI: InChI=1S/C20H8Br4O5/c21-16-14(15(20(27)28)17(22)19(24)18(16)23)13-9-3-1-7(25)5-11(9)29-12-6-8(26)2-4-10(12)13/h1-6,25,27H
charge 0 multiplicity 1
37 atoms
Br 0.750077 -0.165738 -3.11665
Br 4.238216 -0.307937 2.612468
Br 4.123162 -0.524404 -3.236591
Br 5.888474 -0.607996 -0.349022
O  -3.226451 0.232838 -0.096993
O  -3.818085 -4.489043 -0.239252
O  -2.947291 5.017724 0.037748
O  0.606829 -1.094021 2.730482
O  1.060581 1.184992 2.869266
C  -0.375128 0.041024 -0.184469
C  -1.193152 -1.158886 -0.198902
C  -0.979777 1.302159 -0.116318
C  1.119015 -0.094276 -0.247251
C  -2.617948 -1.023317 -0.15572
C  -2.439221 1.41018 -0.0750
C  1.876433 -0.110085 0.95302
C  -0.667425 -2.482094 -0.250979
C  -0.240166 2.554873 -0.098114
C  1.804058 -0.220322 -1.483853
C  -3.481836 -2.128218 -0.168681
C  -3.105688 2.611488 -0.022943
C  -1.508005 -3.602262 -0.266478
C  3.281615 -0.26243 0.919771
C  -2.920319 -3.419905 -0.226839
C  -0.883366 3.768186 -0.047369
C  3.216124 -0.365752 -1.529802
C  -2.362283 3.876211 -0.006827
C  3.962565 -0.393011 -0.317229
C  1.161226 0.098512 2.26748
H  0.417177 -2.623155 -0.270581
H  0.853655 2.50914 -0.119483
H  -4.564467 -1.9905 -0.137202
H  -4.197961 2.648028 0.002624
H  -1.081158 -4.611503 -0.305939
H  -0.327453 4.711694 -0.030239
H  -3.347062 -5.357988 -0.287733
H  0.134934 -0.93281 3.5941
