program: Gaussian 09
title: 000275508
version: EM64L-G09RevD.01
frameworkgroup: C1[X(C24H14O5)]
method: RPBEPBE
basis: SDD
operation: Freq
keyword: #pfreq=noraman
keyword: PBEPBE/SDD
title: #p freq=noraman PBEPBE/SDD
converged: YES YES NO NO
title: Mulliken charges:
elementType: O O O O O C C C C C C C C C C C C C C C C C C C C C C C C H H H H H H H H H H H H H H
charge: -0.261265 -0.416785 -0.260945 -0.426186 -0.216423 0.231892 0.251915 0.160379 0.113643 0.209357 0.188165 0.386272 0.195838 -0.397013 0.136443 -0.338770 -0.299369 -0.457278 -0.255939 -0.516270 -0.439001 -0.528105 -0.352408 -0.429122 0.316648 -0.367343 -0.253408 0.152607 0.035955 0.274576 0.260252 0.252393 0.248031 0.241578 0.291176 0.247947 0.279135 0.275510 0.227477 0.249281 0.241813 0.362663 0.384686
chargesum: 0.00000
title: Mulliken charges with hydrogens summed into heavy atoms:
elementType: O O O O O C C C C C C C C C C C C C C C C C C C C C C C C
charge: -0.261265 -0.054123 -0.260945 -0.041499 -0.216423 0.231892 0.251915 0.160379 0.113643 0.209357 0.188165 0.386272 0.195838 -0.122436 0.136443 -0.078518 -0.046976 -0.209247 -0.014360 -0.225094 -0.191054 -0.248970 -0.076899 -0.201646 0.316648 -0.118061 -0.011595 0.152607 0.035955
polarizability: 4.11741547e+02 -6.30664790e+01 3.60640499e+02 2.74411722e+01 1.19274275e+01 1.98166659e+02
1716.lowfreq: -4.8587 -0.0007 -0.0006 -0.0005 0.6029 6.6215 31.2358 34.1655 37.2100
frequency: 31.2274 34.1390 37.1862 60.5317 70.7696 83.8495 93.4272 128.6496 144.7622 160.0987 175.9360 182.6783 206.0016 229.2014 252.9456 267.9500 287.1353 313.4497 322.0182 333.5181 340.0683 384.5137 385.9501 415.4208 427.8454 440.6514 456.1289 465.9437 471.5449 480.6269 504.2664 521.6410 553.2794 575.0025 581.6715 584.1859 599.5428 608.1787 613.7484 625.3024 629.9206 655.0433 661.7220 700.9745 719.3825 722.6321 738.2110 745.2574 757.1715 775.9005 785.1347 787.2357 797.5178 823.6651 842.7289 844.4032 865.4021 873.1552 889.1061 905.2406 930.8064 935.9222 938.7262 951.2787 959.2146 984.5381 989.9820 999.3815 1023.7063 1057.0684 1080.9154 1097.4052 1099.6157 1117.6217 1142.1798 1156.4678 1170.3430 1178.4033 1191.3903 1213.4922 1214.6511 1227.1938 1239.1608 1252.6906 1283.2016 1293.3192 1311.0668 1329.1164 1361.8345 1370.7256 1381.1554 1384.2534 1396.4383 1421.8202 1429.4719 1445.5395 1454.0549 1489.2507 1497.6088 1518.0793 1550.0132 1559.3176 1575.2416 1577.1042 1595.1481 1612.0144 1616.8558 1640.2463 1651.6466 3129.8081 3130.4824 3132.7697 3142.9851 3145.1094 3158.0236 3166.4368 3167.9308 3169.8130 3177.4794 3178.5111 3191.2280 3515.7850 3581.6715
redmass: 7.5289 6.1152 7.2759 7.1186 8.4577 5.9515 5.3964 7.7097 7.2175 4.5839 6.2289 6.2847 5.2382 5.9950 6.5944 4.8764 6.0854 5.6904 7.2278 8.5006 6.9146 1.1276 6.3504 5.0416 4.1126 3.5158 3.1300 5.4059 3.7078 4.7474 5.0938 6.1250 5.1069 4.2880 6.4334 2.9483 4.3385 3.9509 3.6429 2.8088 4.8876 3.7669 3.3733 6.7848 4.3216 3.7424 7.8960 6.2636 3.0895 2.1465 1.9874 2.6913 1.6997 1.5792 4.8087 2.1603 1.5435 1.7459 4.6035 3.2687 1.6463 1.4580 3.3884 1.5309 3.0653 1.3058 1.3462 1.3928 4.8456 3.1943 2.8320 2.0840 1.9698 2.0007 1.5141 1.3425 1.3094 1.3204 1.9408 1.4861 1.5234 1.8448 1.8688 2.4812 1.8455 3.7802 2.2013 2.5763 4.3115 2.3841 3.6699 4.1344 5.6082 2.0670 5.9543 4.5230 2.5437 5.7254 4.0006 5.0524 7.2556 8.4126 6.9255 6.8112 5.8940 6.5790 6.6686 8.5867 7.7154 1.0897 1.0882 1.0873 1.0883 1.0897 1.0932 1.0994 1.0981 1.0942 1.0929 1.0969 1.0932 1.0641 1.0661
irintensity: 0.0580 0.2830 1.3727 0.4143 2.0944 0.7271 1.1065 1.8444 2.5791 0.5188 1.3271 2.8178 3.3210 0.5044 0.3251 1.1828 2.2474 0.8412 14.4168 0.4484 4.5422 132.4254 2.5721 0.4032 2.9015 3.1416 0.3371 12.4201 2.2078 3.3522 16.0701 1.2252 14.3051 17.0446 18.8439 38.7653 28.2392 12.2035 25.7113 40.1077 3.3854 17.8362 20.5547 1.5583 20.5472 4.0875 1.7847 6.3776 4.1333 43.2260 15.8790 1.5433 19.9309 5.4467 11.0036 37.5465 19.1236 66.8880 49.1279 1.9262 7.3773 7.0727 46.8052 2.5769 32.0795 0.4432 1.4114 3.3303 55.4363 118.7971 33.0290 253.1843 43.6027 32.8217 124.2118 9.5285 16.7888 1.0890 23.9713 23.8727 11.9697 0.7716 3.9543 11.1038 72.8088 39.4901 48.3772 5.7681 53.4299 21.4311 16.7643 74.9284 2.1470 5.3539 19.2149 21.3434 7.8871 230.1291 80.4577 54.9594 41.3067 58.3125 88.6172 23.9568 15.8271 9.4359 431.5346 213.3842 38.1118 13.7597 0.5496 3.7231 8.3707 5.9580 17.7102 12.6956 20.5914 5.3375 0.0148 8.8299 0.9397 39.0925 101.3643
temp: 298.150 k
press: 1.00000 atm
elementType: 8 8 8 8 8 6 6 6 6 6 6 6 6 6 6 6 6 6 6 6 6 6 6 6 6 6 6 6 6 1 1 1 1 1 1 1 1 1 1 1 1 1 1
symmnumber: 1
zpe: 818577.7 jmol-1
zpe.correction: 0.311780 hartree
zpe.thermalcorrener: 0.334328 hartree
zpe.thermalcorrenthalpy: 0.335272 hartree
zpe.thermalcorrgfe: 0.260031 hartree
zpe.sumelectzpe: -1297.124014 hartree
zpe.sumelectthermal: -1297.101466 hartree
zpe.sumelectthermalent: -1297.100521 hartree
zpe.sumelectthermalfe: -1297.175762 hartree
dipole: -11.3008 4.1421 -2.5608
dipole: 12.3054
quadrupole: -184.6388 -156.0561 -156.3153
quadrupole: 18.4653 -2.7831 8.8010
quadrupole: -18.9687 9.6140 9.3547 18.4653 -2.7831 8.8010
hfenergy: -1297.4357936 hartree
pointgroup: C01 [X(C24H14O5)]
dipole: -2.9606041 3.8295471 -0.0881053 debye
polarizability: 341.3558084|-59.2585074|416.4585563|18.4693788|53.3161626|212.7343399 unknown
InChI: InChI=1S/C24H14O5/c25-14-7-9-16-20(11-14)29-21-12-15(26)8-10-17(21)23(16)18-5-1-3-13-4-2-6-19(22(13)18)24(27)28/h1-12,25,27H
charge 0 multiplicity 1
43 atoms
O  3.103425 -0.38655 -0.072346
O  3.474305 4.335616 0.375872
O  3.110597 -5.148709 -0.613139
O  -0.521944 1.222337 3.168803
O  -0.240593 -0.815504 2.100693
C  0.275703 -0.295812 -0.569366
C  -1.183854 -0.205627 -0.902105
C  1.034922 0.929074 -0.343988
C  -2.211544 0.328533 -0.024978
C  0.951292 -1.525676 -0.578848
C  2.4411 0.839959 -0.08237
C  -3.532833 0.55747 -0.595822
C  2.391741 -1.582229 -0.340851
C  -1.527629 -0.579379 -2.215722
C  -2.030785 0.696868 1.369343
C  0.475611 2.240216 -0.39035
C  0.292434 -2.809393 -0.763068
C  -3.823381 0.16703 -1.943309
C  -2.841166 -0.417483 -2.738143
C  3.241068 1.968398 0.158709
C  -4.560398 1.192274 0.177597
C  3.121306 -2.748852 -0.349042
C  -3.052916 1.357799 2.07381
C  1.252943 3.383397 -0.159139
C  2.639805 3.241697 0.126285
C  0.995753 -3.991367 -0.771146
C  -4.319858 1.617679 1.481432
C  2.465035 -4.037744 -0.58504
C  -0.85283 0.27393 2.182972
H  -0.740403 -0.975879 -2.865342
H  -0.587364 2.356992 -0.61695
H  -0.795493 -2.813574 -0.877941
H  -4.830614 0.346145 -2.336545
H  -3.057243 -0.723449 -3.766511
H  4.3092 1.858977 0.357087
H  -5.542352 1.343517 -0.285714
H  4.199676 -2.736497 -0.169843
H  -2.868303 1.642254 3.113273
H  0.793327 4.378352 -0.197691
H  0.493109 -4.955872 -0.903005
H  -5.099673 2.119887 2.062143
H  2.973536 5.187642 0.327376
H  0.218585 0.852156 3.721921
