program: Gaussian 09
title: 000275484
version: EM64L-G09RevD.01
frameworkgroup: C1[X(C14H22N2O2)]
method: RPBEPBE
basis: SDD
operation: Freq
keyword: #p
keyword: freq=noraman
keyword: PBEPBE/SDD
title: #p freq=noraman PBEPBE/SDD
converged: YES YES NO NO
title: Mulliken charges:
elementType: O O N N C C C C C C C C C C C C C C H H H H H H H H H H H H H H H H H H H H H H
charge: -0.304039 -0.282348 -0.008862 -0.081555 -0.053294 0.000076 0.321766 -0.399446 -0.395154 -0.212769 -0.208021 -0.238217 -0.228533 -0.253710 -0.678492 -0.681034 -0.625681 -0.595640 0.202027 0.226463 0.256585 0.216117 0.187132 0.224712 0.182717 0.219343 0.219464 0.207804 0.223147 0.226089 0.205090 0.228662 0.225572 0.224079 0.298422 0.202451 0.252289 0.217003 0.255659 0.224125
chargesum: 0.00000
title: Mulliken charges with hydrogens summed into heavy atoms:
elementType: O O N N C C C C C C C C C C C C C C
charge: -0.304039 -0.282348 -0.008862 -0.081555 0.148733 0.000076 0.321766 -0.172983 -0.138569 0.190481 0.199408 -0.018874 -0.009069 -0.029631 -0.021453 -0.021710 0.127481 0.101147
polarizability: 2.36800445e+02 2.79805928e+01 1.98485395e+02 -1.41612629e+01 -2.32262455e+00 1.33089747e+02
1716.lowfreq: -11.9362 -7.0202 -0.0006 -0.0003 -0.0002 4.7689 18.3220 34.7071 41.6206
frequency: 17.9848 34.0565 41.2918 46.9625 52.5504 61.0158 78.8889 101.5232 109.1179 118.9645 147.0764 165.0312 190.5498 205.3681 215.7042 245.3915 250.4515 260.1238 271.4843 283.9393 313.0345 331.0383 373.8844 405.2334 432.3218 454.1948 508.5323 545.9156 564.3544 616.0106 637.0390 652.0388 697.0081 761.9932 787.1129 808.4932 811.0840 830.9163 840.8393 844.8637 892.7302 907.2581 910.4379 962.9730 967.9644 985.9975 987.6566 1020.2461 1027.6234 1034.8998 1037.3898 1055.2324 1076.1786 1090.1227 1103.0172 1116.0113 1120.5958 1127.8659 1136.6268 1138.7432 1168.1230 1187.7392 1238.9985 1243.1274 1251.8379 1252.7174 1296.0406 1309.0595 1322.8537 1349.0260 1371.4377 1375.9892 1377.2924 1391.9770 1396.0523 1416.8581 1427.9979 1436.0828 1449.8736 1459.9386 1460.7958 1465.4117 1477.5580 1479.8366 1480.6186 1482.3489 1491.1935 1493.6650 1501.6473 1562.3256 1579.0601 1609.4780 2911.1649 2935.1561 2941.1496 2950.0788 2975.8452 2991.2240 2992.1133 2993.4036 3033.9099 3037.2745 3072.1633 3088.5871 3089.2709 3096.5368 3100.3190 3107.8354 3115.0381 3123.1613 3129.5815 3136.7645 3152.9230 3164.8290
redmass: 3.6136 2.3705 2.9337 2.6042 2.7334 2.9338 2.1328 2.9467 2.2623 1.8174 1.2349 3.2959 2.7864 2.1302 2.0703 1.5889 1.5795 3.0284 3.2348 4.4662 3.8039 3.6999 4.8537 2.8772 3.9815 3.0006 3.4668 4.7382 4.6507 6.3729 5.6241 5.9956 1.7707 2.0211 4.4403 1.1107 1.1138 3.6003 1.5287 2.4232 3.4598 1.7178 3.1944 4.8735 1.3916 4.8624 1.3724 2.8237 1.8077 2.0607 3.0695 3.1005 1.8156 1.2436 2.0794 2.2087 2.0983 1.3783 1.4637 1.5120 1.0546 1.1220 3.2791 1.1654 2.4103 1.2558 1.7481 1.1952 1.6672 1.4414 1.4807 1.5892 3.1409 1.2773 1.2886 1.1525 1.3966 1.8570 1.0603 1.0418 1.0413 1.0593 1.0514 1.0561 2.1236 1.1095 1.0791 1.0812 1.0711 5.4831 6.0502 6.2558 1.0830 1.0592 1.0648 1.0421 1.0357 1.0361 1.0370 1.1012 1.0970 1.0943 1.0975 1.0988 1.0990 1.1011 1.1011 1.1024 1.0847 1.0873 1.0975 1.0933 1.0957 1.0991
irintensity: 0.1214 0.0153 0.5461 0.5979 1.0455 1.0129 1.2847 2.2704 4.9035 2.6025 0.4257 2.0368 5.7161 2.2577 6.0955 3.2413 3.5793 0.5337 1.6487 0.5250 7.3833 0.8292 13.0688 0.0646 2.2375 2.3744 7.2855 0.7470 5.1299 0.6129 12.6740 16.3940 47.1672 45.0851 14.1686 4.1760 4.1849 4.2396 9.6204 38.8179 57.8454 31.5237 133.8730 114.9031 1.3215 0.5172 1.4150 22.2748 4.2665 13.3943 134.7597 122.8009 10.8852 0.1698 14.8364 12.6727 34.8121 33.5401 7.2577 8.3797 0.1293 0.8849 6.9018 2.1501 2.5554 2.3189 17.0348 20.7618 9.3826 17.4617 19.4921 2.3493 7.0250 25.6865 25.7299 15.6060 12.8799 4.5175 11.3244 11.0697 11.6809 17.7312 6.0056 6.9491 37.8007 7.4817 4.3982 6.3280 13.4043 244.2940 23.8464 9.1756 43.0801 48.7752 70.8681 105.5037 84.5219 28.6124 31.0158 27.7139 22.3289 42.6383 22.8924 34.6308 32.0440 38.0665 37.2117 3.6138 10.7279 2.1360 12.3940 39.8838 34.0446 17.7440
temp: 298.150 k
press: 1.00000 atm
elementType: 8 8 7 7 6 6 6 6 6 6 6 6 6 6 6 6 6 6 1 1 1 1 1 1 1 1 1 1 1 1 1 1 1 1 1 1 1 1 1 1
symmnumber: 1
zpe: 883790.6 jmol-1
zpe.correction: 0.336618 hartree
zpe.thermalcorrener: 0.357322 hartree
zpe.thermalcorrenthalpy: 0.358267 hartree
zpe.thermalcorrgfe: 0.284869 hartree
zpe.sumelectzpe: -805.166762 hartree
zpe.sumelectthermal: -805.146057 hartree
zpe.sumelectthermalent: -805.145113 hartree
zpe.sumelectthermalfe: -805.218511 hartree
dipole: 2.1974 -0.0778 1.1566
dipole: 2.4844
quadrupole: -104.2540 -94.1751 -108.6647
quadrupole: 0.9942 -2.9859 -1.3378
quadrupole: -1.8894 8.1895 -6.3001 0.9942 -2.9859 -1.3378
hfenergy: -805.5033799 hartree
pointgroup: C01 [X(C14H22N2O2)]
dipole: 0.8599457 -0.0779785 -0.4580408 debye
polarizability: 240.4429853|-18.4918699|186.2527989|22.1435836|-21.4570123|141.679803 unknown
InChI: InChI=1S/C14H22N2O2/c1-5-17-14(18-6-2)13(15-16(3)4)12-10-8-7-9-11-12/h7-11,14H,5-6H2,1-4H3
charge 0 multiplicity 1
40 atoms
O  1.731669 -0.173684 -1.324016
O  1.604141 1.407788 0.430339
N  0.147344 -1.355387 1.132763
N  1.3445 -1.86697 1.493221
C  0.799839 0.58954 -0.441746
C  -0.139116 -0.313013 0.352029
C  -1.60349 -0.061627 0.184122
C  -2.110848 1.24227 -0.088295
C  -2.54321 -1.126042 0.308864
C  1.049882 -0.788318 -2.478891
C  2.391423 2.44226 -0.287145
C  -3.496754 1.467415 -0.244272
C  -3.925251 -0.899867 0.156239
C  -4.414014 0.398854 -0.128637
C  2.126106 -1.400381 -3.375619
C  3.018429 3.346958 0.771722
C  2.681471 -1.253258 1.310387
C  1.245158 -2.933517 2.506875
H  0.196169 1.234301 -1.121819
H  -1.42831 2.098948 -0.134058
H  -2.161875 -2.126979 0.532695
H  0.335829 -1.560511 -2.124777
H  0.469351 -0.011161 -3.023789
H  3.155625 1.945449 -0.913367
H  1.709445 3.013712 -0.955001
H  -3.860394 2.482293 -0.443579
H  -4.625522 -1.738174 0.252028
H  1.662709 -1.878892 -4.257786
H  2.82993 -0.625465 -3.725975
H  2.699785 -2.166636 -2.825605
H  3.618565 4.141147 0.290775
H  2.239278 3.821198 1.392869
H  3.681578 2.765004 1.435264
H  -5.4887 0.573602 -0.252137
H  2.864184 -1.044863 0.245184
H  3.434456 -1.963746 1.690795
H  2.755912 -0.298395 1.86515
H  1.935348 -3.761514 2.260975
H  0.210463 -3.304495 2.512506
H  1.495893 -2.556642 3.520413
