program: Gaussian 09
title: 000275481
version: EM64L-G09RevD.01
frameworkgroup: C1[X(C12H18N2O2)]
method: RPBEPBE
basis: SDD
operation: Freq
keyword: #p
keyword: freq=noraman
keyword: PBEPBE/SDD
title: #p freq=noraman PBEPBE/SDD
converged: YES YES NO NO
title: Mulliken charges:
elementType: O O N N C C C C C C C C C C C C H H H H H H H H H H H H H H H H H H
charge: -0.288656 -0.282479 -0.010468 -0.076092 0.012616 -0.070883 0.321434 -0.395819 -0.395810 -0.238484 -0.227772 -0.253377 -0.618291 -0.597726 -0.515132 -0.511503 0.203611 0.233662 0.257168 0.219200 0.219138 0.223963 0.296324 0.251774 0.204388 0.221358 0.255654 0.222508 0.232326 0.228059 0.203086 0.241965 0.232969 0.201288
chargesum: 0.00000
title: Mulliken charges with hydrogens summed into heavy atoms:
elementType: O O N N C C C C C C C C C C C C
charge: -0.288656 -0.282479 -0.010468 -0.076092 0.012616 0.132728 0.321434 -0.162157 -0.138642 -0.019284 -0.008635 -0.029414 0.134195 0.101794 0.148340 0.164720
polarizability: 2.30450516e+02 2.26287811e+01 1.67087394e+02 -5.91292272e+00 9.04235714e+00 1.02889501e+02
1716.lowfreq: -10.5913 -7.1423 -2.7439 -0.0008 -0.0004 0.0007 33.3997 50.1699 60.8565
frequency: 33.3738 50.1510 60.8564 79.4503 79.8512 96.0075 112.6492 121.8353 138.2484 168.2521 173.7881 202.5686 212.3484 229.2781 257.6585 277.5377 312.4394 319.0519 345.3690 383.3309 405.7305 447.1851 501.2041 507.7089 572.2603 611.3124 625.0213 648.5457 698.2797 763.9117 793.6505 842.9713 851.8518 877.8458 899.7195 916.9240 969.3896 981.9300 986.5243 988.9108 997.8744 1028.4098 1033.0584 1046.8354 1076.5967 1090.5769 1104.9580 1109.6966 1118.5626 1124.8875 1144.1153 1157.2073 1168.2823 1188.4626 1239.6387 1258.5714 1301.3012 1323.2812 1331.3299 1365.6058 1377.2801 1416.3409 1417.0023 1430.8589 1434.7013 1440.8984 1450.6410 1456.2699 1458.5329 1469.8002 1476.8290 1479.1221 1479.6552 1481.6730 1488.9147 1560.6693 1578.9238 1609.5906 2906.7206 2939.2789 2953.6475 2954.2253 2975.2614 3022.2581 3028.5750 3061.6186 3071.5800 3085.4336 3104.3454 3115.3161 3120.7344 3123.3289 3129.8962 3136.9423 3153.5058 3165.6086
redmass: 3.3049 3.5100 3.1253 2.4408 2.4204 1.6919 1.9444 2.4895 1.7111 1.4117 1.1670 2.7843 2.4415 2.5424 3.8323 3.5730 3.9111 4.2652 4.2137 5.0233 2.8960 2.9440 4.0041 4.5096 4.4491 6.4303 6.4042 6.1190 1.7927 1.9163 5.2842 1.3384 5.0822 5.6640 2.2618 2.1613 1.4015 5.3201 4.2638 1.4332 9.8197 2.3235 2.3369 1.8092 1.7382 1.2424 1.2734 1.9765 1.2827 1.3488 1.3745 1.5633 1.0563 1.1238 3.6616 3.0458 1.7061 1.3778 1.5329 1.5698 6.3081 1.1719 1.1431 1.4258 1.4574 1.3014 1.0552 1.0506 1.0665 1.0485 1.0678 1.0715 1.3070 1.5197 1.1368 5.2171 6.0373 6.1977 1.0834 1.0347 1.0385 1.0372 1.0324 1.1007 1.0991 1.0948 1.1019 1.1022 1.0991 1.0846 1.1030 1.0874 1.0966 1.0934 1.0961 1.0985
irintensity: 0.1206 0.4733 1.0372 1.6115 3.8377 1.5424 0.5348 3.7849 4.4017 3.9646 0.2879 2.9076 1.7974 10.8813 3.9277 1.4711 2.7894 1.5222 6.0569 8.7835 0.0848 1.2391 0.9958 6.7958 4.5868 6.3483 10.6965 15.9272 47.2643 46.1599 8.9667 4.3879 68.9201 42.2277 21.8020 39.9960 0.6241 41.5141 3.2370 0.9033 168.6351 19.7040 55.6058 64.8010 11.7783 1.5020 3.8523 46.3304 1.7146 1.9081 6.7260 9.2840 0.1133 1.2240 3.3152 5.2169 8.2653 11.5259 11.6596 31.4940 6.6704 20.9508 10.5966 10.8720 8.4003 6.5908 11.7393 9.6818 19.3728 5.7760 14.1438 23.1727 10.0307 32.8389 12.3013 284.1238 24.8369 10.5069 57.9382 66.5516 104.2331 76.1193 101.4137 44.5796 45.1592 38.1822 26.6937 5.3302 29.1455 9.6764 22.8508 3.0002 11.0939 38.6950 34.5267 16.6837
temp: 298.150 k
press: 1.00000 atm
elementType: 8 8 7 7 6 6 6 6 6 6 6 6 6 6 6 6 1 1 1 1 1 1 1 1 1 1 1 1 1 1 1 1 1 1
symmnumber: 1
zpe: 737558.5 jmol-1
zpe.correction: 0.280921 hartree
zpe.thermalcorrener: 0.298765 hartree
zpe.thermalcorrenthalpy: 0.299710 hartree
zpe.thermalcorrgfe: 0.234557 hartree
zpe.sumelectzpe: -726.708902 hartree
zpe.sumelectthermal: -726.691058 hartree
zpe.sumelectthermalent: -726.690113 hartree
zpe.sumelectthermalfe: -726.755266 hartree
dipole: 2.1792 -0.5870 1.4513
dipole: 2.6832
quadrupole: -89.5429 -81.9399 -96.5038
quadrupole: 3.4669 -1.2703 1.2937
quadrupole: -0.2140 7.3890 -7.1749 3.4669 -1.2703 1.2937
hfenergy: -726.989823 hartree
pointgroup: C01 [X(C12H18N2O2)]
dipole: 0.8561678 -0.3407553 0.5150678 debye
polarizability: 230.9424117|22.6570467|161.1964287|-2.0652834|19.8639037|108.288571 unknown
InChI: InChI=1S/C12H18N2O2/c1-14(2)13-11(12(15-3)16-4)10-8-6-5-7-9-10/h5-9,12H,1-4H3
charge 0 multiplicity 1
34 atoms
O  1.9696 -1.224763 0.976513
O  1.506536 -1.425836 -1.328624
N  0.740669 1.442277 0.052189
N  2.039147 1.805008 0.010091
C  0.203181 0.224627 -0.050005
C  0.899008 -1.131405 -0.051144
C  -1.29025 0.205045 -0.038004
C  -2.018608 -0.869349 -0.626899
C  -2.034916 1.269144 0.549474
C  -3.431168 -0.887289 -0.610659
C  -3.443095 1.250582 0.563143
C  -4.15436 0.168304 -0.011727
C  3.202652 0.990769 -0.405233
C  2.273749 3.245477 0.201114
C  1.425413 -1.28696 2.336729
C  2.01696 -2.807443 -1.424954
H  0.149173 -1.918309 0.199371
H  -1.484476 -1.675999 -1.142715
H  -1.482165 2.106149 0.986598
H  -3.966543 -1.7215 -1.079114
H  -3.991377 2.078998 1.027385
H  -5.249945 0.153619 0.001961
H  2.882189 0.224225 -1.130354
H  3.666806 0.469126 0.450221
H  3.940248 1.665338 -0.876842
H  3.035516 3.415382 0.986171
H  1.325649 3.709937 0.506832
H  2.627963 3.722524 -0.735406
H  0.903052 -0.348033 2.607688
H  2.289621 -1.436095 3.003167
H  0.717991 -2.135697 2.451095
H  2.846527 -2.968631 -0.714845
H  2.366063 -2.924183 -2.462232
H  1.206688 -3.537539 -1.219689
