program: Gaussian 09
title: 000275472
version: EM64L-G09RevD.01
frameworkgroup: C1[X(C13H14N2O4)]
method: RPBEPBE
basis: SDD
operation: Freq
keyword: #p
keyword: freq=noraman
keyword: PBEPBE/SDD
title: #p freq=noraman PBEPBE/SDD
converged: YES YES NO NO
title: Mulliken charges:
elementType: O O O O N N C C C C C C C C C C C C C H H H H H H H H H H H H H H
charge: -0.262591 -0.221081 -0.226297 -0.300169 -0.121600 -0.362705 -0.267198 -0.419800 0.183932 0.270611 -0.484485 0.216028 -0.502340 0.257981 -0.343723 -0.365032 -0.220858 -0.230820 -0.224324 0.345261 0.262930 0.263462 0.248493 0.260766 0.320835 0.243699 0.238473 0.243635 0.271110 0.226755 0.233800 0.231218 0.234037
chargesum: 0.00000
title: Mulliken charges with hydrogens summed into heavy atoms:
elementType: O O O O N N C C C C C C C C C C C C C
charge: -0.262591 -0.221081 -0.226297 -0.300169 -0.121600 -0.041871 0.078063 0.106592 0.183932 0.270611 0.024774 0.216028 0.223466 0.257981 -0.072613 -0.138278 0.012942 0.000397 0.009713
polarizability: 2.26987461e+02 -1.10169886e-01 1.35102235e+02 -2.62286529e-01 -1.08187693e+01 1.39241385e+02
1716.lowfreq: -6.2383 -2.6669 -1.9211 0.0007 0.0008 0.0009 21.7348 27.5886 28.3419
frequency: 21.7082 27.5590 28.2508 50.2276 59.6196 74.0108 77.3253 93.1833 118.8877 153.5060 164.0979 195.8009 214.2648 257.8642 264.8805 301.2035 313.5325 347.1973 379.1390 403.1595 419.2624 438.4431 498.0869 524.1528 555.9438 579.1299 614.5944 648.7704 660.0880 688.3521 703.4873 733.4266 765.1427 793.6838 803.7050 817.6512 857.3001 880.4913 915.5573 937.9427 959.3321 983.7960 985.3595 990.5934 1005.6088 1009.1419 1025.0439 1045.1331 1067.8289 1084.5906 1111.9379 1112.5582 1126.5693 1136.3137 1149.7262 1153.0853 1163.9606 1174.5753 1190.7007 1236.5813 1286.1234 1315.1814 1318.1633 1343.4434 1385.5830 1409.9616 1426.5079 1431.2809 1438.7563 1452.8299 1454.7077 1462.2268 1469.0188 1496.5205 1564.8733 1600.7400 1611.8751 1613.2413 1648.7028 3005.9198 3028.1919 3086.4665 3094.3363 3108.0996 3124.7822 3134.4673 3141.8952 3147.4404 3153.7288 3159.9700 3171.3917 3201.8138 3573.6390
redmass: 4.6243 5.6492 5.9669 4.8084 6.3964 5.6963 5.8690 1.1489 4.2959 4.0963 4.8471 3.5503 4.6364 3.7353 5.8164 4.3632 5.6851 3.9733 4.2347 2.8123 4.8130 5.0348 2.9475 1.5228 4.6153 4.1435 6.3591 3.8047 6.0181 5.0756 1.5512 6.0226 5.2796 2.4252 2.7304 4.1875 1.2501 6.0137 5.8124 1.4421 3.9975 3.5772 1.4782 4.6310 1.3442 2.0372 2.3469 2.6289 1.2069 1.5903 1.4217 1.2856 2.2225 2.1677 1.5389 2.1719 2.8637 1.0609 1.1487 1.2300 2.2648 1.6636 1.3417 1.5271 9.2149 1.8731 1.4064 1.7493 1.3733 1.0497 1.2628 1.0517 1.9123 2.2963 6.3682 6.6301 6.2628 8.6595 9.6615 1.0296 1.0587 1.0532 1.1046 1.1046 1.0862 1.0877 1.0914 1.0924 1.1048 1.0959 1.1007 1.1186 1.0782
irintensity: 2.1860 1.5212 0.1704 1.1953 5.3124 3.2078 2.0895 0.3026 2.3292 8.7442 2.6842 10.2141 12.3477 5.8577 6.9286 17.2498 11.0442 14.4690 0.1732 0.3891 10.2024 16.1774 31.5252 60.2935 28.7549 7.2884 0.7686 17.8894 1.5499 6.0013 87.7170 8.5045 16.0017 16.8490 10.4022 2.8041 1.1070 4.7640 2.2048 3.1724 24.3788 3.2704 1.5533 0.9772 0.1874 62.2248 5.2267 21.2380 5.1789 13.3696 33.3156 6.0598 73.1176 76.3606 49.7850 204.3993 29.4678 0.4020 6.3230 14.5883 122.8005 113.2980 5.4244 64.6062 1.7724 91.0901 38.4243 3.8225 13.3870 14.5060 7.8011 12.1198 128.6320 146.8037 131.5976 46.7664 47.0325 250.5975 152.2706 32.5019 19.8628 12.8167 7.1275 24.3524 5.3771 2.4183 22.7908 21.3457 14.1285 17.7867 18.9381 1.8839 23.6896
temp: 298.150 k
press: 1.00000 atm
elementType: 8 8 8 8 7 7 6 6 6 6 6 6 6 6 6 6 6 6 6 1 1 1 1 1 1 1 1 1 1 1 1 1 1
symmnumber: 1
zpe: 663658.0 jmol-1
zpe.correction: 0.252774 hartree
zpe.thermalcorrener: 0.271367 hartree
zpe.thermalcorrenthalpy: 0.272311 hartree
zpe.thermalcorrgfe: 0.202533 hartree
zpe.sumelectzpe: -912.761407 hartree
zpe.sumelectthermal: -912.742814 hartree
zpe.sumelectthermalent: -912.741870 hartree
zpe.sumelectthermalfe: -912.811647 hartree
dipole: 2.4497 -2.8119 -1.9903
dipole: 4.2272
quadrupole: -93.9627 -117.6861 -97.2182
quadrupole: 11.0548 -3.1414 -4.2732
quadrupole: 8.9930 -14.7304 5.7375 11.0548 -3.1414 -4.2732
hfenergy: -913.0141805 hartree
pointgroup: C01 [X(C13H14N2O4)]
dipole: 1.0679008 -0.9813879 -0.8138969 debye
polarizability: 226.3940041|6.2102145|137.0772613|4.5521619|-10.724054|137.8598151 unknown
InChI: InChI=1S/C13H14N2O4/c1-19-13(18)10-8-15(10)11(16)7-14-12(17)9-5-3-2-4-6-9/h2-6,10,14H,7-8H2,1H3
charge 0 multiplicity 1
33 atoms
O  -3.578446 -2.004985 -0.469666
O  -0.702079 2.913463 0.560901
O  -5.013078 -0.171943 -0.28713
O  0.45634 -0.543094 0.452365
N  -2.421149 1.359724 0.242321
N  0.927908 1.109562 -1.095985
C  -2.712167 -0.066142 0.583147
C  -2.969682 1.089481 1.577502
C  -1.181885 1.930353 -0.065507
C  -3.895108 -0.699047 -0.094645
C  -0.502648 1.3378 -1.322308
C  1.32379 0.151315 -0.176134
C  -4.673667 -2.767944 -1.119196
C  2.799842 -0.025408 0.037788
C  3.220938 -0.642553 1.243289
C  3.771859 0.373971 -0.91717
C  4.593185 -0.835246 1.502992
C  5.145577 0.176668 -0.657488
C  5.559641 -0.421961 0.555286
H  -1.837678 -0.705854 0.743623
H  -4.006439 1.402637 1.733933
H  -2.286949 1.186024 2.429469
H  -0.618116 2.057002 -2.151805
H  -0.99129 0.390698 -1.605153
H  1.591255 1.82029 -1.403857
H  -5.537519 -2.847362 -0.438038
H  -4.239991 -3.755068 -1.329365
H  -4.989799 -2.263289 -2.047485
H  2.454753 -0.96371 1.956252
H  3.466523 0.801297 -1.879744
H  4.91075 -1.306268 2.439482
H  5.890081 0.479504 -1.401735
H  6.626143 -0.572815 0.755759
