program: Gaussian 09
title: 000275451
version: EM64L-G09RevD.01
frameworkgroup: C1[X(C10H11ClO2)]
method: RPBEPBE
basis: SDD
operation: Freq
keyword: #p
keyword: freq=noraman
keyword: PBEPBE/SDD
title: #p freq=noraman PBEPBE/SDD
converged: YES YES NO NO
title: Mulliken charges:
elementType: Cl O O C C C C C C C C C C H H H H H H H H H H H
charge: -0.070220 -0.278033 -0.197334 -0.525961 0.410341 -0.458958 0.176235 -0.393066 -0.347665 -0.108904 -0.231391 -0.056652 -0.537207 0.228668 0.245080 0.241850 0.270652 0.265815 0.243697 0.253826 0.174220 0.221047 0.247290 0.226672
chargesum: 0.00000
title: Mulliken charges with hydrogens summed into heavy atoms:
elementType: Cl O O C C C C C C C C C C
charge: -0.070220 -0.278033 -0.197334 -0.052212 0.410341 0.053543 0.176235 -0.127251 -0.103969 -0.108904 0.022435 0.117567 0.157802
polarizability: 1.63736230e+02 -9.81095326e+00 1.32424298e+02 5.40921351e+00 6.18635029e+00 7.31236781e+01
1716.lowfreq: -9.2997 -0.0023 -0.0021 -0.0016 2.7567 4.8321 32.5125 59.6917 76.3552
frequency: 32.4789 59.6796 76.3431 89.7881 139.3859 157.4174 170.9202 201.2032 227.5661 235.0766 262.2065 315.9684 357.6861 372.2895 455.3003 497.1886 535.4202 578.5571 617.8599 665.5265 679.0586 724.4892 750.3880 801.0914 841.5331 868.5753 886.4741 907.3594 923.5793 985.8129 1025.7553 1071.1478 1087.1344 1112.1011 1122.1102 1151.2397 1160.5807 1192.5860 1232.3693 1254.6572 1265.8908 1283.0935 1345.7758 1372.9232 1379.7556 1404.1719 1425.5045 1436.3183 1460.8131 1468.2988 1469.9266 1482.8156 1587.6211 1599.3154 1643.0760 2854.0786 2963.0439 2966.2730 3010.0884 3014.1759 3052.4716 3074.6717 3126.3388 3155.3925 3157.4817 3177.8910
redmass: 8.2901 3.3679 3.4639 4.1618 4.8423 7.3310 1.7300 4.7342 2.7863 1.4829 2.6895 4.9718 4.9047 5.5087 3.3904 3.8644 3.9173 4.8906 6.8735 1.3945 3.2250 3.7979 4.5138 1.5014 1.3455 2.5576 2.5960 2.1660 1.3643 8.7317 1.8273 2.8146 1.9923 1.2612 1.8774 1.4611 1.2845 1.9584 3.0725 1.3255 1.3846 1.2426 1.6059 1.2204 7.5304 3.4070 1.0882 1.2026 1.1750 1.0757 1.2296 1.6749 7.5270 7.3449 7.5058 1.0843 1.0332 1.0616 1.0959 1.0600 1.1041 1.1026 1.0998 1.0922 1.0880 1.0968
irintensity: 3.2143 5.6230 1.8907 1.5525 7.6483 5.6153 1.0135 5.3070 1.5002 1.4285 5.4714 1.5703 0.5695 0.9625 11.9862 7.9347 8.6848 7.0008 29.1563 5.6503 7.1188 0.4141 0.6882 51.5084 0.9647 21.6282 32.5640 13.6614 0.5751 36.7732 6.8482 0.9689 6.4483 0.0881 64.3102 7.0668 16.2605 68.4019 69.3797 21.9222 33.1896 1.7216 13.7979 3.8544 7.2128 20.0666 37.6445 10.1130 31.0698 33.1139 104.0651 48.7715 0.3906 10.7970 145.3589 164.5517 66.6797 34.4905 5.0187 12.9858 43.1859 12.4051 19.6976 3.8388 4.5221 5.0269
temp: 298.150 k
press: 1.00000 atm
elementType: 17 8 8 6 6 6 6 6 6 6 6 6 6 1 1 1 1 1 1 1 1 1 1 1
symmnumber: 1
zpe: 484506.2 jmol-1
zpe.correction: 0.184539 hartree
zpe.thermalcorrener: 0.197818 hartree
zpe.thermalcorrenthalpy: 0.198762 hartree
zpe.thermalcorrgfe: 0.143237 hartree
zpe.sumelectzpe: -997.178846 hartree
zpe.sumelectthermal: -997.165566 hartree
zpe.sumelectthermalent: -997.164622 hartree
zpe.sumelectthermalfe: -997.220147 hartree
dipole: -0.0357 4.2761 2.2643
dipole: 4.8387
quadrupole: -98.9623 -72.3995 -84.7708
quadrupole: -3.4188 -8.4338 -2.5186
quadrupole: -13.5847 12.9780 0.6067 -3.4188 -8.4338 -2.5186
hfenergy: -997.3633843 hartree
pointgroup: C01 [X(C10H11Cl1O2)]
dipole: -0.2432505 -1.6980794 0.8255112 debye
dipolederiv: -0.5412257 0.3503464 0.0253018 0.3880931 -0.4749759 -0.0149494 0.0323283 -0.0174975 -0.0773378 -0.7287632 0.6368637 0.0302151 0.4841413 -1.2999612 -0.0432032 -0.0179675 -0.0610001 -0.2728008 -0.721734 -0.1431233 0.1005952 -0.1927877 -0.3726085 0.1246986 0.2709476 0.1669776 -0.6259047 -0.0661039 0.0047071 -0.0072594 0.0711728 0.1449454 0.0016114 -0.0804034 -0.0246637 0.0553368 0.312171 0.1125238 -0.0108139 0.2828848 -0.1428471 -0.0097275 -0.0575218 -0.0080913 -0.0775694 -0.5297208 -0.2061198 0.0647211 -0.2909338 0.0301572 0.0850145 0.2856084 0.1490333 -0.0058773 0.5307368 -0.8162781 -0.0440593 -0.657584 0.6914906 0.038544 -0.008963 0.0587958 0.0710036 -0.1629191 0.0572241 -0.0202164 0.1169654 -0.0720685 -0.0159326 -0.0121573 -0.0124845 -0.1080531 -0.1100063 0.238871 -0.0096329 -0.0359881 -0.0464238 -0.0050866 -0.0122052 -0.0330883 -0.1884894 0.6283387 -0.5222792 -0.0453711 -0.6594694 0.5680598 0.0214919 -0.037363 0.023844 -0.0703184 -0.1549383 0.054226 -0.0163458 0.1959283 -0.0659228 -0.019995 -0.0068785 -0.0095598 -0.1130657 1.1435583 0.2990697 -0.0641077 0.3206137 0.217268 -0.2344503 -0.1506798 -0.2499452 0.7945256 0.1748532 0.0967334 0.0064043 -0.1488385 0.8736399 0.0148871 0.0159616 -0.0231783 0.3123255 0.0583775 0.020762 -0.0136813 -0.0224775 -0.1038223 0.0711371 -0.0218969 0.0374505 0.055191 0.0268291 0.0214619 0.051502 0.0310716 0.0481482 -0.0761111 0.0254026 -0.0556746 -0.0080246 0.053505 0.0293121 0.0472045 0.0427372 0.0558565 -0.1053182 -0.0368644 -0.0884079 -0.0370069 0.1174221 0.0275336 0.0020549 0.078145 -0.0077454 0.0882282 -0.0247657 0.0471168 0.088653 0.0924972 -0.0442381 0.0165914 -0.040108 -0.0312247 0.015074 0.0126234 0.0193861 0.1472122 0.0817431 -0.0235495 0.0080237 -0.0296969 -0.0926328 0.0156663 0.0116683 0.0202385 0.1614291 -0.040597 -0.0306853 0.0271077 -0.0296686 0.0878452 0.008357 0.028268 0.0072828 0.1637689 -0.1738065 -0.0288947 -0.1426086 -0.0117892 0.0705366 0.0520209 -0.2116512 0.0313761 -0.2184095 0.059586 -0.1253241 0.0993546 0.0191468 -0.0441567 0.0129375 0.0684816 0.0909406 -0.1085703 -0.0658056 0.1374105 0.0216554 0.0766572 0.0076277 -0.0079705 0.0219138 -0.0107149 0.1182575 0.0160027 -0.1465532 -0.1266351 0.0117843 -0.0411852 -0.016924 -0.093886 -0.058136 -0.0562754 unknown
polarizability: 160.4904871|-13.581967|136.1832549|-5.2226084|-3.2821347|72.6104639 unknown
InChI: InChI=1S/C10H11ClO2/c1-13-10-5-4-9(11)7-8(10)3-2-6-12/h4-7H,2-3H2,1H3
charge 0 multiplicity 1
24 atoms
Cl -3.720757 2.256426 -0.021619
O  0.675819 -1.859053 -0.305124
O  4.209926 1.517986 -0.493964
C  1.401231 0.833836 -0.565352
C  -0.044855 0.421488 -0.36075
C  2.247035 0.661621 0.718041
C  -0.401141 -0.955513 -0.230482
C  -1.077228 1.38374 -0.294309
C  -1.7469 -1.34864 -0.044427
C  -2.414428 0.981259 -0.102094
C  -2.767498 -0.371224 0.022046
C  3.695487 1.080807 0.563612
C  0.368091 -3.291325 -0.268953
H  1.453585 1.886084 -0.896588
H  1.862841 0.224734 -1.363359
H  1.816847 1.237107 1.565602
H  2.233718 -0.39858 1.046331
H  -0.832816 2.445513 -0.399336
H  -2.020457 -2.40319 0.050173
H  -3.810578 -0.666116 0.166342
H  4.313899 0.97244 1.493825
H  -0.093156 -3.5804 0.695347
H  1.338485 -3.796531 -0.381689
H  -0.30115 -3.577968 -1.102777
