program: Gaussian 09
title: 000275460
version: EM64L-G09RevD.01
frameworkgroup: C1[X(C8H12N4O6)]
method: RPBEPBE
basis: SDD
operation: Freq
keyword: #p
keyword: freq=noraman
keyword: PBEPBE/SDD
title: #p freq=noraman PBEPBE/SDD
converged: NO YES NO NO
title: Mulliken charges:
elementType: O O O O O O N N N N C C C C C C C C H H H H H H H H H H H H
charge: -0.257730 -0.440630 -0.469485 -0.498662 -0.305326 -0.199324 -0.193569 -0.010057 -0.625028 0.074125 -0.168889 -0.145862 -0.170872 -0.032035 -0.390578 0.328637 -0.196311 -0.016920 0.265034 0.308809 0.244394 0.256111 0.250393 0.236043 0.352977 0.389655 0.308786 0.380122 0.354241 0.371953
chargesum: 0.00000
title: Mulliken charges with hydrogens summed into heavy atoms:
elementType: O O O O O O N N N N C C C C C C C C
charge: -0.257730 -0.087653 -0.079830 -0.118540 -0.305326 -0.199324 -0.193569 -0.010057 0.101166 0.074125 0.096145 0.162947 0.073522 0.224076 0.095858 0.328637 0.112475 -0.016920
polarizability: 1.81905604e+02 1.57442399e+01 1.15347762e+02 3.56305542e+00 -1.61129142e+01 1.18919736e+02
1716.lowfreq: -8.2320 -6.0992 -0.0007 -0.0004 -0.0001 7.4054 21.8421 33.0094 66.2244
frequency: 21.2587 32.6581 66.2173 90.1614 108.0062 116.4744 158.3559 186.8983 203.0715 233.3869 238.7903 272.6517 279.4468 289.9840 310.7576 330.0370 347.8004 373.0032 397.2466 419.7523 436.3097 464.4156 479.1962 550.5937 587.9818 621.2916 649.7645 688.0493 698.0421 713.6029 723.8533 727.7167 743.1599 767.6110 774.6365 796.1970 805.9790 867.7689 919.9848 938.4704 954.7144 970.6883 986.0068 1010.6604 1030.0901 1077.9591 1090.2473 1120.8040 1134.0209 1159.8978 1173.9948 1180.0729 1199.5975 1212.0878 1226.9531 1269.0950 1273.3091 1282.0847 1300.5789 1303.1804 1312.8390 1335.9430 1343.6017 1372.1588 1380.1410 1403.8799 1421.0409 1430.7652 1471.7047 1481.3567 1545.7305 1637.1021 2987.5362 3000.4447 3033.2520 3056.7188 3060.8798 3078.9330 3255.2322 3341.3112 3420.7538 3575.5740 3604.5133 3625.9611
redmass: 6.3010 5.6992 7.0744 5.9219 8.5990 6.9839 3.8916 6.0281 6.1608 5.9694 5.0360 2.5551 3.2942 2.4336 2.9714 1.4285 3.3152 3.4064 5.1043 5.2250 6.0977 1.3322 5.9318 5.1600 5.2160 5.9260 5.1873 7.0403 1.5822 1.4143 3.3212 2.1609 5.2998 4.8273 1.6049 6.2326 3.5087 4.6479 3.5651 2.9410 7.3070 2.9576 2.3930 4.9143 3.0564 2.5021 2.3230 4.4223 1.8961 3.5717 1.3825 1.2042 1.4695 2.2145 1.2481 1.4256 1.1984 2.0508 1.3316 1.8974 1.9340 1.4057 1.4049 1.3620 7.7452 1.5549 1.4641 5.9745 1.0826 4.6842 1.2685 5.1593 1.0860 1.0564 1.0863 1.0925 1.0895 1.1026 1.0997 1.0659 1.0512 1.0665 1.0671 1.0980
irintensity: 1.2711 5.6600 4.8771 0.8575 2.1375 3.7221 5.1474 7.7980 15.5581 12.9726 7.4873 66.5812 9.8194 36.6000 54.2718 106.4187 41.1944 11.4602 6.4424 3.2899 8.1356 123.0838 32.2104 5.0952 3.0771 6.6835 8.4364 7.7075 89.0063 100.1864 84.1063 108.9683 7.4774 49.7431 31.4105 63.5535 45.1373 31.6095 64.2161 25.8934 55.2984 46.8102 22.1591 153.7403 40.4905 1.9265 9.9073 133.4891 2.4334 51.3095 48.3464 27.0853 42.7815 101.1048 25.4757 4.4671 20.4068 11.5738 1.4784 8.8456 36.5607 3.3193 28.7068 28.6583 215.3915 6.3005 39.0680 52.9983 5.6473 205.4543 30.4307 299.5124 50.9770 24.1044 18.6379 6.7193 10.6766 50.2911 16.3998 191.4535 64.1995 16.4530 17.3781 84.4126
temp: 298.150 k
press: 1.00000 atm
elementType: 8 8 8 8 8 8 7 7 7 7 6 6 6 6 6 6 6 6 1 1 1 1 1 1 1 1 1 1 1 1
symmnumber: 1
zpe: 583562.3 jmol-1
zpe.correction: 0.222267 hartree
zpe.thermalcorrener: 0.239127 hartree
zpe.thermalcorrenthalpy: 0.240071 hartree
zpe.thermalcorrgfe: 0.176978 hartree
zpe.sumelectzpe: -980.899958 hartree
zpe.sumelectthermal: -980.883099 hartree
zpe.sumelectthermalent: -980.882154 hartree
zpe.sumelectthermalfe: -980.945248 hartree
dipole: -10.1453 -0.4723 2.9008
dipole: 10.5624
quadrupole: -131.1049 -95.3382 -103.2599
quadrupole: -11.5702 7.0950 10.5913
quadrupole: -21.2039 14.5628 6.6411 -11.5702 7.0950 10.5913
hfenergy: -981.1222253 hartree
pointgroup: C01 [X(C8H12N4O6)]
dipole: 3.9679085 1.0125693 0.7065677 debye
polarizability: 172.6353206|26.1994316|126.5060625|-14.177591|12.228529|117.0317183 unknown
InChI: InChI=1S/C8H12N4O6/c9-6-7(12(16)17)10-2-11(6)8-5(15)4(14)3(1-13)18-8/h2-5,8,13-15H,1,9H2
charge 0 multiplicity 1
30 atoms
O  1.535327 1.112522 1.097361
O  2.360382 2.878797 -1.19671
O  2.716657 -0.752801 -1.553583
O  3.677036 -1.904475 0.653726
O  -3.912032 -0.354341 1.397347
O  -4.139751 -1.975981 -0.216046
N  -0.267639 0.454565 -0.391584
N  -1.588415 -1.174734 -1.298486
N  -1.623203 1.162165 1.519534
N  -3.47894 -1.019154 0.333518
C  1.878172 1.498179 -1.244527
C  0.80466 1.429784 -0.142549
C  2.957904 0.473221 -0.799156
C  2.749864 0.320603 0.747082
C  2.528506 -1.13522 1.194641
C  -1.405385 0.388059 0.417936
C  -0.42678 -0.533204 -1.41076
C  -2.214744 -0.616492 -0.175465
H  1.500998 1.23133 -2.248934
H  0.354394 2.423938 0.020995
H  3.974813 0.861085 -1.00831
H  3.582871 0.774567 1.308623
H  1.577334 -1.520754 0.781642
H  2.506784 -1.188761 2.298057
H  3.058185 3.006867 -1.887325
H  3.219226 -1.485578 -1.08723
H  0.354134 -0.745136 -2.135191
H  3.719005 -2.802194 1.064053
H  -0.856674 1.627255 2.004034
H  -2.529794 0.994286 1.973108
