program: Gaussian 09
title: 000275444
version: EM64L-G09RevD.01
frameworkgroup: C1[X(C11H12ClNO4)]
method: RPBEPBE
basis: SDD
operation: Freq
keyword: #p
keyword: freq=noraman
keyword: PBEPBE/SDD
title: #p freq=noraman PBEPBE/SDD
converged: YES YES NO NO
title: Mulliken charges:
elementType: Cl O O O O N C C C C C C C C C C C H H H H H H H H H H H H
charge: -0.064657 -0.277878 -0.243931 -0.417677 -0.221681 0.014413 0.353427 -0.559276 0.150104 -0.325598 -0.334712 -0.123975 -0.237854 -0.195281 -0.534851 -0.350638 0.211876 0.248432 0.254191 0.306884 0.244816 0.252954 0.260493 0.223694 0.246225 0.223067 0.254347 0.259455 0.383632
chargesum: 0.00000
title: Mulliken charges with hydrogens summed into heavy atoms:
elementType: Cl O O O O N C C C C C C C C C C C
charge: -0.064657 -0.277878 -0.243931 -0.034045 -0.221681 0.014413 0.353427 -0.056653 0.150104 -0.018714 -0.089896 -0.123975 0.015100 0.065211 0.158135 0.163164 0.211876
polarizability: 2.11112609e+02 -1.26598063e+01 1.68811118e+02 4.01003540e+00 2.79600864e+00 8.09894816e+01
1716.lowfreq: -3.1401 0.0014 0.0021 0.0023 2.3671 4.4213 18.7044 20.2434 45.5357
frequency: 18.6630 20.2243 45.5308 52.5308 62.5010 78.7880 129.9393 150.1255 161.6349 181.6445 197.2909 225.6046 239.7967 263.3298 293.9829 317.0426 346.1280 363.6720 383.0417 440.6336 457.8870 489.8886 505.9922 534.5154 547.5854 588.1672 619.2125 626.5361 639.7532 715.8235 747.3356 795.5747 802.2971 831.8127 852.1857 908.9025 922.4598 935.5152 963.6104 988.5612 997.8644 1021.3700 1057.3816 1084.3309 1104.4895 1112.3695 1114.4684 1148.0859 1182.2015 1203.2995 1228.5924 1231.8564 1258.0215 1265.5889 1289.3085 1321.9181 1353.1711 1376.6990 1399.8825 1411.6628 1437.6530 1453.9689 1467.8286 1469.2140 1482.6245 1585.6367 1596.5138 1601.5385 1683.6500 2961.7528 3001.5928 3010.0217 3050.6564 3059.5899 3079.8820 3092.5901 3126.1637 3141.5974 3155.7737 3175.7756 3516.8889
redmass: 7.4535 5.8909 4.7205 8.5194 10.1109 3.8364 4.3367 3.7307 3.8426 4.6088 5.8679 2.1196 1.3506 5.8730 5.4955 6.5528 4.9941 7.2108 4.2518 2.9071 2.9471 2.3307 4.5109 3.7780 4.2021 4.2226 5.7764 2.2526 2.3469 3.8857 4.5784 3.1644 1.6583 4.5753 4.8409 1.6256 1.4186 1.4591 1.7656 8.6822 2.9853 3.3748 2.9966 2.0846 2.3732 2.1242 1.3575 1.4390 1.4056 1.3281 1.1159 3.6417 1.6159 1.3980 1.3354 1.6662 1.6104 6.9327 3.3893 1.0776 1.2017 1.1171 1.0508 1.3131 1.6552 8.0764 6.6071 7.4970 9.0157 1.0328 1.0604 1.0605 1.1041 1.0975 1.0925 1.1002 1.0996 1.0939 1.0878 1.0969 1.0642
irintensity: 0.8604 0.8375 0.5041 0.3612 1.8765 1.4844 5.9644 8.4324 1.6820 1.1759 2.6692 7.3972 2.7900 1.2613 5.3913 0.4889 0.1247 0.4034 5.9222 18.8357 37.7630 15.9096 20.1024 6.3311 29.1059 4.1568 43.0609 54.0368 83.3473 5.5611 3.3962 67.8848 47.9051 14.3476 35.0293 29.1533 4.1777 10.9273 18.1385 50.4696 214.0946 226.9073 36.5329 1.3242 1.5783 78.1528 14.3561 4.2953 14.6169 28.6092 0.4349 125.2641 17.0645 15.1272 5.1108 5.3736 18.1096 15.6318 12.3325 34.6911 13.9957 44.3360 14.7686 126.6052 38.0207 0.6724 13.1674 0.7329 232.4469 71.8739 7.4469 31.7587 45.3141 2.2258 11.1880 3.3087 21.5151 7.5825 6.0723 8.7252 25.6615
temp: 298.150 k
press: 1.00000 atm
elementType: 17 8 8 8 8 7 6 6 6 6 6 6 6 6 6 6 6 1 1 1 1 1 1 1 1 1 1 1 1
symmnumber: 1
zpe: 560804.5 jmol-1
zpe.correction: 0.213599 hartree
zpe.thermalcorrener: 0.231049 hartree
zpe.thermalcorrenthalpy: 0.231993 hartree
zpe.thermalcorrgfe: 0.165136 hartree
zpe.sumelectzpe: -1240.738634 hartree
zpe.sumelectthermal: -1240.721185 hartree
zpe.sumelectthermalent: -1240.720240 hartree
zpe.sumelectthermalfe: -1240.787097 hartree
dipole: 2.3159 -1.7705 -0.4662
dipole: 2.9522
quadrupole: -71.1209 -107.3423 -107.1466
quadrupole: -8.8872 2.3698 -2.1205
quadrupole: 24.0824 -12.1390 -11.9433 -8.8872 2.3698 -2.1205
hfenergy: -1240.9522333 hartree
pointgroup: C01 [X(C11H12Cl1N1O4)]
dipole: -0.6638311 -0.8992866 0.3157394 debye
polarizability: 195.8200457|27.0143844|175.9996679|14.58818|-20.6052506|89.0934951 unknown
InChI: InChI=1S/C11H12ClNO4/c1-16-10-3-2-9(12)6-8(10)4-5-13-17-7-11(14)15/h2-3,5-6,14H,4,7H2,1H3
charge 0 multiplicity 1
29 atoms
Cl -1.545304 3.061531 -1.252166
O  -2.452219 -2.654889 0.437325
O  3.589164 -0.610463 -0.337642
O  4.745608 2.719329 0.715008
O  2.703474 2.105835 -0.222019
N  2.423843 -0.815672 0.565953
C  -0.987797 -0.790381 0.09606
C  0.153336 -1.663199 0.621742
C  -2.31154 -1.317199 0.023891
C  -0.766035 0.549557 -0.298401
C  -3.385685 -0.517994 -0.434876
C  -1.847392 1.331573 -0.749576
C  -3.153197 0.820514 -0.825045
C  1.450273 -1.382771 -0.094666
C  -3.786268 -3.254576 0.362004
C  4.436639 0.387792 0.287232
C  3.8280 1.788217 0.207595
H  0.294314 -1.485491 1.704779
H  -0.126631 -2.725183 0.502793
H  0.242388 0.976125 -0.250315
H  -4.402513 -0.916081 -0.493069
H  -3.977219 1.445925 -1.180066
H  1.530963 -1.605573 -1.170289
H  -4.503055 -2.722365 1.01695
H  -3.657145 -4.287555 0.716772
H  -4.16656 -3.261363 -0.678025
H  4.630037 0.145744 1.349206
H  5.391349 0.372645 -0.265518
H  4.351172 3.632571 0.676365
