program: Gaussian 09
title: 000275454
version: EM64L-G09RevD.01
frameworkgroup: C1[X(C13H16N4O5)]
method: RPBEPBE
basis: SDD
operation: Freq
keyword: #p
keyword: freq=noraman
keyword: PBEPBE/SDD
title: #p freq=noraman PBEPBE/SDD
converged: YES YES NO NO
title: Mulliken charges:
elementType: O O O O O N N N N C C C C C C C C C C C C C H H H H H H H H H H H H H H H H
charge: -0.318811 -0.265764 -0.443904 -0.433274 -0.246828 -0.193743 -0.203410 -0.079047 -0.619125 -0.162694 -0.064729 -0.048718 -0.122391 -0.339370 0.197654 -0.179238 0.113601 -0.397681 0.297546 0.143851 -0.331680 -0.756389 0.242918 0.281392 0.251546 0.269123 0.191583 0.270456 0.287180 0.393428 0.249841 0.346734 0.250767 0.249976 0.247443 0.255832 0.327674 0.338249
chargesum: 0.00000
title: Mulliken charges with hydrogens summed into heavy atoms:
elementType: O O O O O N N N N C C C C C C C C C C C C C
charge: -0.318811 -0.265764 -0.050476 -0.086539 -0.246828 -0.193743 -0.203410 -0.079047 0.046798 0.080224 0.216663 0.202829 0.146733 0.122669 0.197654 0.107943 0.113601 -0.147840 0.297546 0.143851 -0.080914 -0.003139
polarizability: 2.56635417e+02 1.08347287e+01 1.72437439e+02 -1.18950938e+01 2.11206976e+01 1.29560373e+02
1716.lowfreq: -16.0839 -5.7610 -4.2340 0.0005 0.0007 0.0008 4.5148 16.1624 29.6330
frequency: -14.1453 16.0148 29.5964 48.2869 52.6298 75.8000 88.5178 97.7222 130.0302 148.6099 159.4408 184.6608 207.7805 233.2877 249.3424 278.0091 288.4526 293.2542 307.8594 335.3314 381.4220 436.5729 450.9938 466.8816 487.4368 517.3253 525.8379 537.8006 547.4642 555.7943 564.1935 578.9694 609.8735 618.6963 622.4416 658.8712 676.2601 702.0799 733.3436 788.8338 796.7475 829.0961 850.8869 868.3464 875.8865 885.7350 924.1454 945.3430 957.7847 965.8340 973.9776 998.9314 1014.6780 1023.0399 1042.5657 1044.7665 1050.5231 1051.8529 1062.3015 1085.6949 1097.9115 1168.6421 1175.4145 1188.8535 1196.5191 1215.1353 1242.1189 1247.7635 1253.1318 1268.5950 1294.6590 1301.2529 1327.9425 1334.1709 1340.4979 1346.1265 1351.7197 1361.6093 1375.3341 1381.7026 1386.0073 1431.9358 1452.5946 1454.3280 1455.9078 1469.2301 1488.3964 1493.6694 1538.5692 1581.9744 1627.7303 1647.3293 2911.1437 2943.8481 2956.7651 2977.1934 3007.7579 3051.0528 3070.5667 3098.2102 3100.1994 3142.5328 3171.8449 3214.6386 3260.9918 3533.3223 3545.9007 3702.7455
redmass: 1.0575 5.5145 6.1706 8.0195 5.9748 4.0580 5.5549 4.7571 3.5734 5.7097 4.7572 6.7587 5.6471 5.4750 5.4802 5.7520 4.8967 4.5338 4.6067 4.3948 3.9652 1.1570 3.0762 1.2664 3.8053 5.4599 4.1871 1.6263 2.3544 3.1422 4.2734 4.2370 3.7248 5.5975 4.3935 7.7741 4.8686 6.8803 1.3577 4.4456 5.4123 5.4885 4.3718 1.3590 4.0348 1.2487 1.4178 5.0636 2.6200 2.5865 4.6349 2.3254 3.5920 3.3590 2.3903 2.3847 2.8259 1.9182 3.1106 3.3863 2.3497 2.9631 1.2308 1.7772 2.3055 1.6021 1.6424 1.3936 1.6363 1.4198 1.3732 2.2983 1.2957 1.7752 1.6804 2.4826 1.9009 1.3311 1.3439 3.0816 1.2516 3.0851 1.0586 1.0534 4.4130 1.0835 1.6813 2.7219 6.9187 2.7020 1.8446 9.7644 1.0695 1.0715 1.0819 1.0841 1.0382 1.0859 1.0867 1.0939 1.0945 1.1022 1.0927 1.0944 1.1028 1.0652 1.0454 1.1043
irintensity: 0.8674 1.8203 0.2147 1.4158 0.8593 3.2550 3.7056 1.5309 5.5294 10.9100 3.8966 1.4871 3.2815 3.8579 2.0989 12.1215 5.1083 3.9464 5.8266 4.5708 4.3074 157.0991 50.5138 128.5622 14.3409 14.0743 3.6216 55.2606 12.4020 22.7447 0.7738 1.6992 18.1822 3.8973 25.6152 2.2565 4.1264 18.9525 102.3877 3.0342 3.7118 2.8425 62.7578 1.4842 17.5318 122.8143 3.9835 45.4693 15.3807 52.3920 172.5905 155.5079 10.0963 11.2108 7.3838 7.1908 18.3773 23.8643 29.5882 20.5746 26.2246 15.8823 20.2947 26.6130 283.3823 98.4153 71.4808 4.2211 3.7962 8.2484 14.3465 136.7049 5.5340 31.7709 4.4345 21.7859 37.9167 27.9998 54.4882 67.4735 47.9694 33.8295 24.8079 18.7272 18.1085 9.9066 251.0337 18.8393 38.9325 99.6716 554.9683 167.1730 1030.4741 35.2477 25.2983 76.1109 1.3812 4.6680 14.4165 11.1420 6.4577 8.3060 10.9418 3.4241 3.9209 6.5145 124.7874 36.7687
temp: 298.150 k
press: 1.00000 atm
elementType: 8 8 8 8 8 7 7 7 7 6 6 6 6 6 6 6 6 6 6 6 6 6 1 1 1 1 1 1 1 1 1 1 1 1 1 1 1 1
symmnumber: 1
zpe: 766323.8 jmol-1
zpe.correction: 0.291877 hartree
zpe.thermalcorrener: 0.311538 hartree
zpe.thermalcorrenthalpy: 0.312482 hartree
zpe.thermalcorrgfe: 0.241903 hartree
zpe.sumelectzpe: -1098.473218 hartree
zpe.sumelectthermal: -1098.453557 hartree
zpe.sumelectthermalent: -1098.452613 hartree
zpe.sumelectthermalfe: -1098.523191 hartree
dipole: -4.9253 0.3839 3.5986
dipole: 6.1119
quadrupole: -116.0328 -132.5008 -126.1708
quadrupole: -22.3085 -1.8747 -1.2893
quadrupole: 8.8687 -7.5993 -1.2693 -22.3085 -1.8747 -1.2893
hfenergy: -1098.7650949 hartree
pointgroup: C01 [X(C13H16N4O5)]
dipole: 1.9961353 0.5175508 1.2368553 debye
polarizability: 258.0335725|-7.9544283|127.9042357|2.444592|-21.0856644|172.6954212 unknown
InChI: InChI=1S/C13H16N4O5/c1-6(19)21-10-8(4-18)22-13(9(10)20)17-3-2-7-11(14)15-5-16-12(7)17/h2-3,5,8-10,13,18,20H,4,14H2,1H3
charge 0 multiplicity 1
38 atoms
O  -1.377323 -0.693378 1.292116
O  -2.6144 1.95387 -0.620509
O  -0.380268 0.108919 -2.141666
O  -3.805994 -2.099112 1.770927
O  -4.857396 1.397837 -0.920165
N  0.933766 -0.708029 0.764491
N  2.168832 -0.264764 -1.324862
N  4.591148 -0.172882 -1.042927
N  5.670991 -0.464762 1.010618
C  -0.757855 0.380289 -0.778776
C  -2.285251 0.504694 -0.641945
C  -0.418365 -0.792588 0.191557
C  -2.668722 -0.199664 0.686921
C  -3.604497 -1.403104 0.501151
C  2.095196 -0.509067 0.023418
C  1.292428 -0.927104 2.107331
C  3.209567 -0.600028 0.915966
C  2.680253 -0.86261 2.234275
C  -3.968102 2.272681 -0.815275
C  4.492084 -0.414512 0.308344
C  3.446072 -0.110779 -1.778163
C  -4.156204 3.768939 -0.896503
H  -0.290681 1.304953 -0.376656
H  -2.78737 0.042011 -1.51003
H  -0.530348 -1.756628 -0.350958
H  -3.087648 0.500566 1.428238
H  -3.196958 -2.090737 -0.272685
H  -4.596022 -1.049343 0.177605
H  0.518118 -1.089015 2.851983
H  0.639514 -0.014752 -2.116176
H  3.226913 -0.983445 3.167882
H  -2.906839 -2.273276 2.154828
H  3.566182 0.086318 -2.846793
H  -3.478459 4.288728 -0.201093
H  -5.203994 4.02436 -0.680328
H  -3.913756 4.112165 -1.918902
H  5.690805 -0.638018 2.011332
H  6.539683 -0.322231 0.498227
