program: Gaussian 09
title: 000275405
version: EM64L-G09RevD.01
frameworkgroup: C1[X(C10H11NO4)]
method: RPBEPBE
basis: SDD
operation: Freq
keyword: #p
keyword: freq=noraman
keyword: PBEPBE/SDD
title: #p freq=noraman PBEPBE/SDD
converged: NO YES NO NO
title: Mulliken charges:
elementType: O O O O N C C C C C C C C C C H H H H H H H H H H H
charge: -0.271262 -0.256684 -0.236353 -0.241305 0.096063 0.348133 0.233725 0.342728 -0.509925 -0.353087 -0.378154 -0.250596 -0.204782 -0.531598 -0.535082 0.270930 0.230180 0.249083 0.311769 0.265264 0.228761 0.228592 0.255144 0.251424 0.228492 0.228540
chargesum: 0.00000
title: Mulliken charges with hydrogens summed into heavy atoms:
elementType: O O O O N C C C C C C C C C C
charge: -0.271262 -0.256684 -0.236353 -0.241305 0.096063 0.348133 0.233725 0.342728 -0.238995 -0.122907 -0.129071 0.061173 0.060481 0.180899 0.173374
polarizability: 2.85040932e+02 4.39800981e+00 1.53043465e+02 -4.06688703e-02 6.50709920e-03 6.10273131e+01
1716.lowfreq: -7.3504 -3.8713 -1.0797 -0.0007 -0.0004 0.0003 39.7906 52.1773 76.3694
frequency: 39.7794 52.1652 76.3682 93.6527 104.3321 146.9796 165.5097 193.8258 197.7395 220.0650 233.9724 256.9878 260.0361 294.3583 376.3898 404.3145 462.1295 471.4816 531.5890 548.1537 581.7394 624.2134 661.4868 672.9542 703.8852 740.1865 800.7467 820.4082 843.0754 856.3996 886.3970 940.1962 942.9507 985.6669 1011.4763 1019.1156 1108.2992 1111.8059 1113.7928 1144.5847 1157.8643 1175.6468 1208.3997 1213.2286 1235.7917 1281.0871 1290.5488 1296.8731 1374.9726 1386.0718 1424.5496 1436.2509 1455.1986 1467.5414 1468.2598 1468.8405 1471.4638 1498.3000 1564.5859 1617.3351 1626.8341 2971.9527 2972.7880 3065.3927 3066.1819 3134.9074 3136.4642 3146.8531 3147.8514 3177.0898 3181.9278 3197.9597
redmass: 8.0437 5.3832 6.8756 3.1893 3.4773 3.7816 3.6890 1.5961 1.6554 5.6654 1.5680 6.0825 2.0773 4.2470 3.7892 4.6831 2.7670 6.7420 6.5864 5.9431 4.1195 4.5099 4.7211 9.1970 6.1236 2.7779 1.5262 4.9298 1.7156 1.7999 6.3745 1.3814 5.5826 9.4173 3.2111 1.2381 2.1043 1.2574 1.2572 1.4643 1.3699 1.9775 2.0081 2.8821 1.7842 2.4943 1.5624 2.3966 4.5872 4.3489 1.9190 1.2105 1.7434 1.1255 1.0498 1.0497 1.0903 2.6148 7.1935 5.9984 6.1770 1.0324 1.0324 1.1046 1.1046 1.1003 1.1004 1.0881 1.0896 1.0948 1.0917 1.0941
irintensity: 0.0893 0.0311 1.3322 13.3268 0.6482 2.7592 3.8240 2.6122 0.0008 2.7679 0.0034 2.7709 1.5050 1.8989 1.1437 5.3155 7.7526 7.7444 33.0069 1.1889 16.1449 6.3255 0.2542 5.1680 1.6913 0.3530 38.0462 2.0769 13.5707 63.4441 2.7952 0.0589 26.7426 34.1927 69.5462 38.5855 138.3786 0.0938 0.1575 21.4819 13.8672 112.4701 324.0664 689.7234 40.9477 87.7482 21.4722 39.9827 173.8069 64.3320 26.2887 13.4735 55.0794 82.8059 13.8814 17.0632 30.1964 55.2008 84.1450 581.0524 66.0243 59.7866 70.6448 30.9590 47.3041 21.6561 12.8019 5.7194 3.4295 9.1395 2.0896 9.6048
temp: 298.150 k
press: 1.00000 atm
elementType: 8 8 8 8 7 6 6 6 6 6 6 6 6 6 6 1 1 1 1 1 1 1 1 1 1 1
symmnumber: 1
zpe: 514503.2 jmol-1
zpe.correction: 0.195964 hartree
zpe.thermalcorrener: 0.210687 hartree
zpe.thermalcorrenthalpy: 0.211631 hartree
zpe.thermalcorrgfe: 0.153294 hartree
zpe.sumelectzpe: -742.076309 hartree
zpe.sumelectthermal: -742.061587 hartree
zpe.sumelectthermalent: -742.060642 hartree
zpe.sumelectthermalfe: -742.118979 hartree
dipole: 9.8475 -0.1264 0.0037
dipole: 9.8484
quadrupole: -112.4725 -69.6596 -89.4030
quadrupole: -8.1701 0.0622 0.0172
quadrupole: -21.9608 20.8521 1.1087 -8.1701 0.0622 0.0172
hfenergy: -742.272273 hartree
pointgroup: C01 [X(C10H11N1O4)]
dipole: -3.873723 -0.0699473 -0.0471694 debye
dipolederiv: -0.2107779 0.3793219 -0.0305949 -0.1401584 -1.6500425 0.1123505 0.0128282 0.1210715 -0.2922343 -2.1929636 0.4423176 -0.0617693 0.2829659 -0.4249354 0.0145791 -0.0481549 0.0161326 -0.2942209 -1.0530116 -0.3141931 0.0140666 -0.4371252 -0.69842 0.0292868 0.0236986 0.0308684 -0.2628748 -0.8266753 0.1114007 -0.0176324 0.5843821 -0.6787114 0.043841 -0.056987 0.0372674 -0.2469542 2.5676602 0.2515068 0.0145126 -0.3947415 1.0268669 -0.0738556 0.0690407 -0.0645557 0.1928203 -1.1932165 -0.1319442 -0.0051926 0.4016736 -0.3352439 0.029656 -0.0499637 0.0221564 -0.0531557 0.6072761 -0.6529593 0.0619164 0.2792475 1.3127509 -0.0985444 -0.0162683 -0.1123638 0.0977863 1.9958058 -0.3209516 0.051191 0.3880883 0.4424062 -0.0216725 -0.008111 -0.0310092 0.12747 -0.5807442 0.4397656 -0.0416004 0.4033907 -0.3137723 0.0137857 -0.0377395 0.0142152 -0.2170067 0.7075332 -0.067945 0.0166636 -0.5137242 0.109515 -0.0240035 0.0535096 -0.0174951 -0.0835017 -0.9850587 -0.0404374 -0.0068742 -0.5769112 -0.1572438 -0.0137974 0.0382932 -0.00688 -0.2232874 1.6039999 0.2065402 0.0062826 0.4323919 0.0334736 0.0020802 -0.0116897 -0.0011679 -0.0175843 -1.6579292 -0.1674512 -0.0077675 -0.5503045 0.0166149 -0.0237067 0.0238416 -0.0180977 -0.1705693 0.2713354 0.3174311 -0.0271723 0.145177 0.8377367 -0.0413373 -0.0127858 -0.0393578 0.3175108 0.7002935 -0.1878282 0.0206769 -0.6997323 0.4758286 -0.022603 0.0614679 -0.0155904 0.3165027 0.0598115 -0.0698263 0.0042032 -0.0767413 0.0074618 0.0133919 0.0052021 0.0134804 0.1784503 0.0378779 -0.0933245 0.0065961 -0.0574875 -0.0199306 0.0124877 0.003727 0.0119026 0.1357132 0.0256216 0.0714791 -0.0082597 0.0928991 -0.0321 0.0188928 -0.0099479 0.0188669 0.1739402 0.1159826 0.0370966 -0.0038608 0.0404898 0.0888304 0.0071599 -0.0045363 0.0070401 0.1665675 0.028296 0.0239133 -0.0046324 0.079389 0.0174385 0.0165852 -0.0097616 0.0156566 0.2028505 -0.0096662 -0.1544499 -0.0986656 -0.0093517 0.0034825 0.0226067 -0.0967608 -0.0441937 -0.0771427 -0.0167112 -0.1363491 0.1253099 0.0084921 0.004759 -0.0365225 0.098785 0.0258853 -0.0709811 0.0175321 0.1273487 -0.0127982 0.0516235 -0.0531447 0.0162308 -0.0062968 0.017423 0.1260938 -0.1597741 0.0000804 -0.0028497 -0.0494247 0.0795609 0.0036122 0.0014386 0.0040614 0.1264441 0.072744 -0.0295697 0.0830393 0.157349 -0.0314189 0.0852695 -0.0097177 0.0976439 -0.09111 0.0747588 -0.0409724 -0.0747885 0.1581429 -0.0617624 -0.0857731 -0.0131116 -0.1029604 -0.0615266 unknown
polarizability: 284.6163998|8.5575845|152.8092259|2.4727001|-7.5045308|61.6860847 unknown
InChI: InChI=1S/C10H11NO4/c1-14-9-4-3-8(5-6-11(12)13)10(7-9)15-2/h3-7H,1-2H3
charge 0 multiplicity 1
26 atoms
O  0.052951 -2.266129 0.162108
O  -4.058698 0.257039 -0.105453
O  4.759939 1.748372 -0.101584
O  4.388201 -0.506609 0.076666
N  3.969942 0.716636 -0.029755
C  0.183242 0.121465 -0.036965
C  -0.637768 -1.0607 0.050609
C  -2.664458 0.291491 -0.09042
C  -2.041838 -0.975146 0.023917
C  -0.487246 1.370031 -0.151562
C  -1.8871 1.477313 -0.179837
C  1.631171 -0.016689 -0.004056
C  2.545379 0.997896 -0.074688
C  -0.721871 -3.508654 0.255549
C  -4.77951 1.532092 -0.216129
H  -2.683083 -1.856846 0.089346
H  0.108356 2.28634 -0.220822
H  -2.355933 2.460189 -0.269923
H  2.029999 -1.034004 0.086797
H  2.345252 2.066088 -0.165871
H  -1.337154 -3.661773 -0.651003
H  -1.367512 -3.507239 1.153917
H  0.030756 -4.305526 0.336329
H  -5.843849 1.257701 -0.202753
H  -4.536726 2.046219 -1.16503
H  -4.551744 2.19384 0.640512
