program: Gaussian 09
title: 000275340
version: EM64L-G09RevD.01
frameworkgroup: C1[X(C6H8Br2O2S)]
method: RPBEPBE
basis: SDD
operation: Freq
keyword: #p
keyword: freq=noraman
keyword: PBEPBE/SDD
title: #p freq=noraman PBEPBE/SDD
converged: YES YES NO NO
title: Mulliken charges:
elementType: Br Br S O O C C C C C C H H H H H H H H
charge: 0.001102 0.001095 0.956087 -0.542065 -0.542072 -0.683660 -0.683657 0.371231 0.371255 -0.852695 -0.852692 0.312191 0.298335 0.312199 0.298324 0.304153 0.313359 0.304153 0.313359
chargesum: 0.00000
title: Mulliken charges with hydrogens summed into heavy atoms:
elementType: Br Br S O O C C C C C C
charge: 0.001102 0.001095 0.956087 -0.542065 -0.542072 -0.073135 -0.073135 0.371231 0.371255 -0.235184 -0.235179
polarizability: 1.62652081e+02 6.84983577e-03 1.29933222e+02 9.08506991e+00 8.66760438e-03 9.69176583e+01
1716.lowfreq: -27.5353 -5.1279 0.0014 0.0016 0.0016 4.9320 5.2839 26.0740 45.7492
frequency: -27.4091 26.0400 45.7357 64.1163 93.3746 133.9185 217.4143 234.0344 249.1574 263.1427 320.7852 331.6934 393.8513 430.1917 469.4482 518.7969 558.4086 596.9754 644.0419 684.4863 739.4504 807.4676 821.3951 857.1936 873.8767 885.6333 953.7254 1009.6268 1090.6729 1092.3187 1107.8382 1127.3613 1185.6975 1197.0536 1212.3811 1215.8045 1241.1514 1319.2527 1407.7900 1409.7012 1449.7712 1486.7762 1631.3609 3033.9543 3034.7272 3073.2947 3076.3812 3119.2431 3119.5549 3153.8990 3159.2248
redmass: 7.6882 19.3186 4.7178 6.7486 7.8630 16.5035 3.3639 5.0139 3.2865 6.4326 4.6534 2.6136 3.6740 8.6895 6.0024 4.6883 4.9897 4.7730 3.5519 6.0471 3.7684 16.1975 1.9865 1.6395 1.3913 1.5262 4.5476 1.8783 1.1530 1.1918 1.1860 1.5490 1.5082 1.3929 1.1517 1.2108 2.4742 4.0618 1.1139 1.0954 1.1433 1.1047 7.3500 1.0552 1.0558 1.0578 1.0585 1.1094 1.1091 1.1109 1.1091
irintensity: 7.3104 0.4728 6.3374 0.5988 3.5818 0.5030 0.3288 3.0990 3.3457 12.3577 23.5400 4.6591 12.2031 19.8880 3.3242 2.1416 82.8446 6.5035 7.7342 50.3459 2.6019 104.0559 6.1108 4.2894 2.5395 0.7790 72.1524 0.3822 0.0697 9.5551 2.3553 20.8870 9.3851 1.6672 69.4590 2.3286 4.9722 2.5732 14.7359 22.3975 12.8098 19.9398 30.6946 0.2031 0.9847 9.6620 1.8438 0.5974 0.0282 0.1210 3.0946
temp: 298.150 k
press: 1.00000 atm
elementType: 35 35 16 8 8 6 6 6 6 6 6 1 1 1 1 1 1 1 1
symmnumber: 1
zpe: 341947.7 jmol-1
zpe.correction: 0.130241 hartree
zpe.thermalcorrener: 0.142185 hartree
zpe.thermalcorrenthalpy: 0.143129 hartree
zpe.thermalcorrgfe: 0.088398 hartree
zpe.sumelectzpe: -807.838557 hartree
zpe.sumelectthermal: -807.826613 hartree
zpe.sumelectthermalent: -807.825669 hartree
zpe.sumelectthermalfe: -807.880400 hartree
dipole: 0.0027 -4.6589 0.0009
dipole: 4.6589
quadrupole: -98.3069 -121.6735 -89.0924
quadrupole: 0.0134 -9.1297 -0.0036
quadrupole: 4.7174 -18.6492 13.9319 0.0134 -9.1297 -0.0036
hfenergy: -807.9687977 hartree
pointgroup: C01 [X(C6H8Br2O2S1)]
dipole: 1.8329485 -0.0014126 -0.0004705 debye
dipolederiv: -0.2399969 -0.2434368 -0.0074244 -0.2370455 -0.5591336 -0.0672976 -0.1488475 -0.294364 -0.1803226 -0.2393926 0.2430387 0.0073732 0.236697 -0.5600363 -0.0673735 0.1483984 -0.2945024 -0.1802565 1.5642425 -0.0003072 0.0000387 -0.0003791 1.0044033 0.0829919 0.0001067 0.1247345 1.1776751 -0.6557724 0.0133491 0.0233837 0.1166753 -0.4877619 -0.0671569 0.2111539 -0.0752697 -0.5949471 -0.6561807 -0.0131662 -0.0234869 -0.1165084 -0.4872806 -0.0670251 -0.2113565 -0.0748722 -0.5948704 -0.2213368 -0.0295388 0.0304261 0.0101847 -0.1736672 0.0445719 -0.0568407 0.0969385 -0.0348137 -0.221339 0.029578 -0.0303408 -0.0100339 -0.1740431 0.0445558 0.0570576 0.0971681 -0.0346677 0.0904249 -0.0367977 0.0785309 -0.3621105 -0.0889359 -0.0676346 0.2724509 0.0598983 -0.1540208 0.091074 0.0365198 -0.078635 0.3618663 -0.0898224 -0.0676734 -0.2723932 0.060337 -0.1539311 0.1387024 0.455511 0.0518712 0.38661 0.7686341 0.2089757 0.1314902 0.2736161 0.2840889 0.1375314 -0.4547446 -0.0516043 -0.3857777 0.7702143 0.2092252 -0.1309036 0.2741736 0.2841086 0.0406671 -0.0112319 0.0049691 0.0065924 0.0187024 -0.0185803 0.0416429 -0.0377837 0.0821473 0.0119049 0.0126117 0.0234515 -0.0311412 0.0813414 0.0158324 -0.0252376 0.0208732 -0.0025497 0.0406392 0.0111965 -0.0049954 -0.0066773 0.0188875 -0.0185506 -0.0417122 -0.0377381 0.0821493 0.0119398 -0.0124378 -0.0234423 0.0312571 0.0813398 0.0158862 0.0252925 0.0205222 -0.002643 0.0948249 -0.0192818 -0.0822494 -0.0473506 -0.0133042 -0.0209441 -0.0490851 -0.016467 -0.0492783 -0.0414437 -0.0298035 -0.0037538 0.0444519 -0.0480742 -0.0693397 -0.0350864 -0.0901868 0.0607549 0.0949699 0.019163 0.0822227 0.0471729 -0.013288 -0.0210747 0.048911 -0.0167542 -0.0493679 -0.0414588 0.0297784 0.0036651 -0.0444835 -0.0481754 -0.0693887 0.0349588 -0.0903234 0.0607447 unknown
polarizability: 129.9332263|0.0124049|159.5716718|0.0129731|16.5993415|99.9980629 unknown
InChI: InChI=1S/C6H8Br2O2S/c7-1-5-3-11(9,10)4-6(5)2-8/h1-4H2
charge 0 multiplicity 1
19 atoms
Br 2.304492 2.801073 0.467044
Br 2.300504 -2.804107 -0.46669
S  -2.119786 0.001808 0.00048
O  -2.91535 0.697347 1.24508
O  -2.916989 -0.692455 -1.243785
C  -0.778404 1.227926 -0.69765
C  -0.780084 -1.226462 0.69807
C  0.544728 0.589927 -0.354313
C  0.543924 -0.590372 0.35457
C  1.782149 1.284826 -0.823142
C  1.780398 -1.286974 0.823358
H  -0.957918 2.190537 -0.191718
H  -0.985666 1.294101 -1.778092
H  -0.961174 -2.188693 0.191981
H  -0.987191 -1.292546 1.778547
H  1.639116 1.8058 -1.780575
H  2.669593 0.640426 -0.870634
H  1.636708 -1.807643 1.780859
H  2.668751 -0.643819 0.870713
