program: Gaussian 09
title: 000275365
version: EM64L-G09RevD.01
frameworkgroup: C1[X(C14H12FN3O5S)]
method: RPBEPBE
basis: SDD
operation: Freq
keyword: #p
keyword: freq=noraman
keyword: PBEPBE/SDD
title: #p freq=noraman PBEPBE/SDD
converged: YES YES NO NO
title: Mulliken charges:
elementType: S F O O O O O N N N C C C C C C C C C C C C C C H H H H H H H H H H H H
charge: 1.090774 -0.348524 -0.278802 -0.483598 -0.479557 -0.204609 -0.203676 -0.424275 -0.494255 0.028757 -0.512930 0.520768 0.507836 -0.141120 -0.422587 -0.346118 -0.428283 -0.307173 -0.186573 -0.206953 0.307407 0.377709 -0.349414 -0.355268 0.241608 0.281795 0.296087 0.247586 0.259105 0.236439 0.324867 0.301005 0.286904 0.285548 0.289798 0.289722
chargesum: 0.00000
title: Mulliken charges with hydrogens summed into heavy atoms:
elementType: S F O O O O O N N N C C C C C C C C C C C C C C
charge: 1.090774 -0.348524 -0.278802 -0.483598 -0.479557 -0.204609 -0.203676 -0.128188 -0.193250 0.028757 0.010473 0.520768 0.507836 -0.141120 -0.175001 -0.087013 -0.191844 0.017694 0.100331 0.078595 0.307407 0.377709 -0.059616 -0.065545
polarizability: 3.98810061e+02 -1.91381742e+01 1.79008766e+02 1.71485632e+01 2.49267843e+00 1.56120103e+02
1716.lowfreq: -14.2887 -5.2249 -1.8222 0.0009 0.0015 0.0019 5.9914 12.5780 19.1330
frequency: -7.8807 12.3143 19.0125 32.7867 37.7842 65.6805 67.1703 70.7500 93.5255 112.6075 138.6796 157.2357 173.9377 189.8405 224.7914 228.5071 264.1852 276.3978 289.0675 310.2852 336.2270 353.6247 378.9558 385.6018 402.2952 410.2423 411.8207 444.9177 457.8941 500.8864 510.9510 530.5292 555.4420 609.6776 612.7588 622.9847 628.4643 649.5096 671.4415 704.8289 714.8065 721.3921 732.6380 769.4902 816.8322 824.5163 831.6282 851.9872 854.0073 857.5235 859.5575 933.2152 956.4977 981.5813 987.4785 991.9119 997.0712 997.6605 1005.7886 1029.0827 1050.8148 1091.8864 1095.6326 1116.0136 1124.8064 1180.5975 1187.1010 1205.9393 1213.4140 1222.9438 1237.7701 1277.1086 1298.0684 1299.1736 1345.0498 1370.9436 1373.3198 1403.9581 1416.6980 1424.1369 1465.2073 1473.9988 1483.4764 1489.8365 1508.5281 1590.5289 1599.8191 1600.1297 1610.8641 1650.2150 2987.0611 3041.7955 3129.1616 3136.3455 3149.3191 3163.1199 3169.7977 3182.4589 3184.6879 3198.4409 3522.2401 3547.7385
redmass: 9.0909 10.6639 5.9458 5.4852 8.6695 7.1055 7.5368 8.4957 6.8831 7.0571 8.2933 7.3411 6.5891 4.7370 8.3640 8.6994 5.7477 7.5149 7.4895 4.1538 7.3272 5.5552 5.7518 6.1161 2.4497 2.8969 3.0326 2.8855 3.6029 5.9186 3.6545 3.9557 9.9911 2.7175 1.8722 5.5562 4.9500 6.4592 4.5453 8.8318 3.6833 5.6078 4.3706 6.5788 4.8677 1.4075 5.2483 13.4291 1.2556 1.6387 1.4408 3.1268 1.3472 5.4098 1.3962 10.8155 1.3917 1.3632 3.0099 2.6176 2.4990 3.8058 3.1248 1.4266 1.3223 1.3101 1.1329 1.9953 2.7769 4.0169 1.2806 1.9706 1.3862 1.3587 1.7242 4.4737 4.2314 6.6239 5.1113 2.9720 1.1739 2.2628 2.1546 1.7823 2.4110 6.3370 7.2314 5.7381 6.1933 4.3748 1.0601 1.1012 1.0904 1.0908 1.0902 1.0916 1.0957 1.0944 1.0955 1.0952 1.0764 1.0776
irintensity: 2.2131 2.3722 0.8317 2.6835 0.0790 4.4182 3.5968 2.5620 0.5952 5.2180 2.1718 2.7207 5.5667 0.9873 0.4477 3.8565 6.1733 22.3730 1.7514 1.9264 38.6796 7.9031 2.0989 6.5809 9.3281 1.5131 0.4655 82.1609 20.0164 3.6350 14.6031 43.4218 233.0377 37.0643 94.7120 19.1709 11.2534 32.7053 25.8188 13.3005 2.1615 1.4285 8.2128 42.7545 6.1222 34.8910 3.0374 134.5614 2.6312 41.2807 64.4187 9.4823 1.2655 11.6892 9.6723 73.8657 1.0466 5.3107 6.2347 11.9124 89.5190 12.3521 6.7193 19.0591 8.5170 40.7910 64.6959 553.7475 70.3266 170.0115 215.1724 14.3913 10.6835 49.7869 5.4496 87.2474 229.5157 1.9816 17.1238 82.8556 35.9159 76.9438 4.2282 268.5823 857.1642 98.9690 25.7805 111.9880 41.3815 180.4329 52.3279 24.4872 11.4653 9.7207 6.2639 4.1162 6.5787 0.0840 4.2402 14.4131 7.7897 37.0196
temp: 298.150 k
press: 1.00000 atm
elementType: 16 9 8 8 8 8 8 7 7 7 6 6 6 6 6 6 6 6 6 6 6 6 6 6 1 1 1 1 1 1 1 1 1 1 1 1
symmnumber: 1
zpe: 654826.4 jmol-1
zpe.correction: 0.249410 hartree
zpe.thermalcorrener: 0.271103 hartree
zpe.thermalcorrenthalpy: 0.272047 hartree
zpe.thermalcorrgfe: 0.194802 hartree
zpe.sumelectzpe: -1577.015172 hartree
zpe.sumelectthermal: -1576.993479 hartree
zpe.sumelectthermalent: -1576.992535 hartree
zpe.sumelectthermalfe: -1577.069780 hartree
dipole: 5.3294 -3.9951 4.6827
dipole: 8.1420
quadrupole: -263.2086 -151.3914 -139.9918
quadrupole: -21.8772 -2.1500 -2.6046
quadrupole: -78.3447 33.4726 44.8721 -21.8772 -2.1500 -2.6046
hfenergy: -1577.2645822 hartree
pointgroup: C01 [X(C14H12F1N3O5S1)]
dipole: 2.0527611 -1.9558075 1.4906721 debye
polarizability: 397.8500497|-22.6788426|176.6148022|19.6484829|6.7076452|159.4740782 unknown
InChI: InChI=1S/C14H12FN3O5S/c15-24(22,23)13-7-3-11(4-8-13)17-14(19)16-9-10-1-5-12(6-2-10)18(20)21/h1-8,16-17H,9H2
charge 0 multiplicity 1
36 atoms
S  -6.868499 0.685932 -0.276698
F  -7.628836 -1.014559 -0.266916
O  -0.239729 -1.155256 -1.58448
O  -7.438509 1.417922 1.03704
O  -7.106173 1.25958 -1.758996
O  8.104787 0.738158 0.634048
O  6.80495 2.611874 0.562053
N  1.115622 -1.601892 0.263857
N  -1.107748 -0.941213 0.606774
N  6.967981 1.333178 0.490018
C  2.283197 -1.957982 -0.555329
C  3.505427 -1.094797 -0.26265
C  -2.440789 -0.561706 0.337522
C  -5.098937 0.186236 -0.032676
C  4.779436 -1.693525 -0.094614
C  3.388195 0.318154 -0.18233
C  -3.281604 -0.308522 1.461572
C  -2.96007 -0.42518 -0.982821
C  -4.623458 0.063853 1.285201
C  -4.304495 -0.053693 -1.166751
C  -0.089475 -1.229824 -0.329926
C  5.771834 0.493729 0.226223
C  5.922935 -0.906624 0.148934
C  4.517041 1.121855 0.061017
H  2.533855 -3.027618 -0.420203
H  1.958685 -1.827668 -1.605629
H  1.209876 -1.662041 1.279033
H  4.879199 -2.783521 -0.153949
H  2.407392 0.785779 -0.319875
H  -2.884329 -0.40723 2.478966
H  -2.308745 -0.6139 -1.837243
H  -0.869382 -1.017573 1.598266
H  -5.275185 0.264893 2.140607
H  -4.718783 0.057356 -2.173704
H  6.913428 -1.349032 0.283084
H  4.450511 2.211362 0.120372
