program: Gaussian 09
title: 000275352
version: EM64L-G09RevD.01
frameworkgroup: C1[X(C14H24O4)]
method: RPBEPBE
basis: SDD
operation: Freq
keyword: #pfreq=noraman
keyword: PBEPBE/SDD
title: #p freq=noraman PBEPBE/SDD
converged: YES YES NO NO
title: Mulliken charges:
elementType: O O O O C C C C C C C C C C C C C C H H H H H H H H H H H H H H H H H H H H H H H H
charge: -0.251128 -0.251155 -0.270120 -0.270183 -0.129872 -0.130104 -0.042461 -0.042516 -0.436093 -0.436019 -0.397738 -0.397629 -0.746363 -0.746401 0.317123 0.317238 -0.762498 -0.762546 0.285961 0.285757 0.195723 0.195779 0.201738 0.193755 0.201712 0.193801 0.233308 0.214061 0.233322 0.214050 0.212284 0.207543 0.226369 0.207493 0.226341 0.212329 0.239095 0.246449 0.263002 0.239070 0.246423 0.263098
chargesum: 0.00000
title: Mulliken charges with hydrogens summed into heavy atoms:
elementType: O O O O C C C C C C C C C C C C C C
charge: -0.251128 -0.251155 -0.270120 -0.270183 0.156089 0.155653 0.153262 0.153263 -0.040600 -0.040506 0.049632 0.049743 -0.100168 -0.100237 0.317123 0.317238 -0.013952 -0.013955
polarizability: 1.83546883e+02 4.39480717e-03 1.60105193e+02 2.07452889e-02 -1.32713430e+01 1.33009670e+02
1716.lowfreq: -18.3309 -13.0195 -10.0670 -0.0009 -0.0009 -0.0008 16.1425 26.5284 37.1022
frequency: -14.0173 26.5278 36.8009 62.7173 80.0333 85.5920 93.8781 98.7050 101.1312 113.9645 157.4888 163.8494 180.3080 187.3248 201.6260 237.9511 261.0182 287.4349 302.3559 322.0860 348.4670 350.7669 376.1961 418.9241 429.4772 470.3488 494.7152 545.1529 553.3156 569.0482 576.3300 600.2221 620.0447 668.0470 753.8217 773.5108 783.7669 801.2977 863.6065 896.5509 915.2873 926.3844 926.4462 945.8508 949.9486 973.4858 1002.2582 1002.9773 1009.8981 1014.8976 1020.3487 1029.8949 1045.3426 1045.5545 1063.5319 1093.1992 1110.4640 1137.5793 1159.2528 1161.5789 1198.6375 1203.3823 1210.5645 1230.4618 1244.0309 1246.3534 1258.3739 1290.2570 1298.5833 1300.3238 1325.8520 1326.5681 1331.3909 1339.6433 1342.6466 1358.6676 1378.7028 1380.2030 1383.6103 1389.0794 1391.0249 1391.9223 1451.4664 1451.9647 1454.8140 1455.3918 1455.6982 1457.7388 1469.2077 1472.9946 1474.1202 1475.2892 1484.1334 1485.2062 1636.4970 1638.1260 2931.9176 2932.6672 2954.4665 2955.1502 2971.8087 2972.1959 2999.3677 3002.3376 3003.0614 3003.1267 3015.7366 3021.2250 3025.4148 3026.3711 3061.9502 3062.3623 3069.9677 3070.2587 3098.6570 3098.7824 3104.4212 3104.7322 3138.4690 3138.6347
redmass: 4.2194 4.4841 3.9501 4.0918 3.7936 5.0182 2.8440 1.1307 1.0619 3.6301 3.1484 2.4279 2.1284 1.3942 1.6831 3.3045 1.8888 2.8337 2.8538 2.6391 2.8313 2.3877 3.8923 3.0480 3.4085 2.9604 2.1164 2.9787 2.9334 3.2995 3.3028 3.5232 4.1766 3.8281 3.2124 4.0815 4.1259 1.8560 2.3037 1.9903 3.5860 2.2876 1.4133 1.8791 3.8038 1.6346 1.7776 1.8322 2.0341 1.8631 1.7189 2.2518 1.6464 1.6463 2.0607 1.7016 2.9987 2.3986 1.6703 2.5945 3.4358 2.0339 3.3678 1.2904 1.1216 1.1922 1.3310 1.2350 1.3898 1.1743 1.2871 1.3952 1.4979 1.3845 1.5504 1.4247 1.2403 1.2306 1.2816 1.2200 1.3092 1.2238 1.0831 1.0949 1.0564 1.0520 1.0706 1.0686 1.0753 1.0603 1.0581 1.0826 1.0569 1.0585 9.0401 9.1929 1.0809 1.0808 1.0675 1.0607 1.0359 1.0362 1.0833 1.0834 1.0386 1.0397 1.0950 1.0936 1.0619 1.0696 1.0986 1.0985 1.0996 1.0994 1.0937 1.0937 1.1033 1.1026 1.1026 1.1025
irintensity: 2.2163 0.0287 0.3526 12.1552 0.0201 0.3050 0.0829 0.3332 1.1075 0.0609 0.1354 3.9526 1.3516 4.0138 2.2960 0.2392 0.0201 4.5042 6.6970 5.9350 5.5342 2.7887 0.3722 3.7330 0.3043 7.2465 5.2696 1.6570 6.5858 8.1981 0.0011 6.7105 3.0131 4.1237 0.2783 16.0141 5.1250 2.6909 0.2928 1.3214 11.2774 1.3686 15.9437 3.3072 85.6030 2.4879 0.8309 55.0353 28.4247 5.5293 12.3883 6.0532 20.7695 1.9923 15.0811 6.3237 2.7699 0.0063 0.7092 0.4476 18.1188 1.2436 486.0033 13.9381 9.1450 30.9348 5.8259 1.4256 0.0029 1.7432 3.9068 1.6865 2.4708 0.4305 1.6104 7.3019 2.5333 72.9239 30.7838 3.6877 16.4138 21.1096 20.8165 1.3305 42.4226 2.7002 23.2318 0.2579 11.5210 0.1698 20.9901 3.3455 22.9383 13.3031 316.7982 9.7947 0.0236 34.6182 19.9541 66.2532 74.7179 2.0747 6.6750 6.3843 0.9151 1.7193 62.0137 16.8805 19.2752 64.3967 15.7990 94.7224 8.7705 62.4147 14.6283 5.9488 24.2972 9.6709 12.6188 4.8872
temp: 298.150 k
press: 1.00000 atm
elementType: 8 8 8 8 6 6 6 6 6 6 6 6 6 6 6 6 6 6 1 1 1 1 1 1 1 1 1 1 1 1 1 1 1 1 1 1 1 1 1 1 1 1
symmnumber: 1
zpe: 944299.8 jmol-1
zpe.correction: 0.359665 hartree
zpe.thermalcorrener: 0.379454 hartree
zpe.thermalcorrenthalpy: 0.380398 hartree
zpe.thermalcorrgfe: 0.310979 hartree
zpe.sumelectzpe: -847.358009 hartree
zpe.sumelectthermal: -847.338220 hartree
zpe.sumelectthermalent: -847.337276 hartree
zpe.sumelectthermalfe: -847.406695 hartree
dipole: -1.1568 -0.0036 -0.0035
dipole: 1.1568
quadrupole: -100.1473 -107.6898 -113.4656
quadrupole: -0.0071 -0.0048 2.0210
quadrupole: 6.9536 -0.5889 -6.3647 -0.0071 -0.0048 2.0210
hfenergy: -847.717674 hartree
pointgroup: C01 [X(C14H24O4)]
dipole: -0.0017743 -0.455122 0.0006079 debye
polarizability: 136.9461335|0.009662|183.5468566|16.3491132|-0.0298911|156.1687554 unknown
InChI: InChI=1S/C14H24O4/c1-9-5-6-10(2)14(8-18-12(4)16)13(9)7-17-11(3)15/h9-10,13-14H,5-8H2,1-4H3
charge 0 multiplicity 1
42 atoms
O  -2.2885 0.979792 -1.12407
O  2.288273 0.979368 1.125374
O  -1.530419 2.135175 0.75825
O  1.534291 2.132122 -0.760233
C  -0.379646 -0.589885 -0.682957
C  0.379921 -0.591047 0.685248
C  -0.071185 -1.886483 -1.497016
C  0.070783 -1.888712 1.497362
C  -0.383876 -3.16003 -0.672221
C  0.38278 -3.161225 0.670658
C  -1.893502 -0.316488 -0.479155
C  1.893879 -0.317845 0.48194
C  -0.746011 -1.904168 -2.886214
C  0.745476 -1.908874 2.886595
C  -1.997907 2.14217 -0.406154
C  1.999399 2.140739 0.405108
C  -2.286104 3.372834 -1.23475
C  2.286111 3.372597 1.232424
H  0.010382 0.266273 -1.267208
H  -0.009706 0.264477 1.270719
H  1.02779 -1.885111 -1.672814
H  -1.028208 -1.886978 1.673098
H  -0.124109 -4.059496 -1.264893
H  -1.47586 -3.219124 -0.474863
H  0.122541 -4.061428 1.262008
H  1.474735 -3.220583 0.473222
H  -2.162226 -0.256201 0.590803
H  -2.544292 -1.046985 -0.982956
H  2.163313 -0.258955 -0.587913
H  2.54438 -1.047611 0.987163
H  -0.395177 -2.769851 -3.47878
H  -1.847002 -1.983083 -2.812423
H  -0.516275 -0.983824 -3.454531
H  1.846403 -1.988656 2.812811
H  0.516468 -0.989107 3.456145
H  0.393839 -2.775052 3.477956
H  -2.61322 4.196848 -0.581693
H  -3.040922 3.16738 -2.008513
H  -1.348324 3.681555 -1.733216
H  2.614791 4.195539 0.578797
H  3.039218 3.168194 2.008129
H  1.347294 3.682239 1.728363
