program: Gaussian 09
title: 000275332
version: EM64L-G09RevD.01
frameworkgroup: C1[X(C12H17NO)]
method: RPBEPBE
basis: SDD
operation: Freq
keyword: #p
keyword: freq=noraman
keyword: PBEPBE/SDD
title: #p freq=noraman PBEPBE/SDD
converged: YES YES NO NO
title: Mulliken charges:
elementType: O N C C C C C C C C C C C C H H H H H H H H H H H H H H H H H
charge: -0.282355 0.039033 -0.570763 -0.111861 0.470201 -0.250444 -0.683922 -0.683963 -0.222187 -0.439663 -0.373033 -0.218101 -0.225687 -0.246702 0.228997 0.206680 0.228741 0.208739 0.218620 0.206770 0.231305 0.218279 0.206219 0.232753 0.218167 0.237799 0.227322 0.259241 0.222757 0.221452 0.225604
chargesum: 0.00000
title: Mulliken charges with hydrogens summed into heavy atoms:
elementType: O N C C C C C C C C C C C C
charge: -0.282355 0.039033 -0.135086 0.116880 0.470201 0.176915 -0.027568 -0.026824 0.015612 -0.212341 -0.113792 0.004656 -0.004235 -0.021097
polarizability: 1.89977167e+02 -4.69489478e+00 1.42042856e+02 -1.68558369e+01 8.39284736e+00 9.49039634e+01
1716.lowfreq: -14.5772 -3.3500 -0.0005 -0.0004 -0.0003 5.6469 15.4203 18.9136 34.1965
frequency: 9.6437 18.0504 34.0385 67.9811 103.9450 128.0033 150.0439 192.5468 205.4978 210.2919 229.8276 284.5521 293.9393 330.2829 404.1343 412.4284 437.2706 479.3100 482.8272 528.1149 575.5090 618.1137 705.4557 751.6342 769.3892 795.8239 853.8232 862.3084 876.5802 916.3659 919.7762 930.9496 948.0798 957.8877 975.1646 976.8923 991.1970 994.1951 1004.9130 1029.8955 1069.8620 1085.9708 1108.1806 1157.4829 1170.4686 1177.4969 1189.0716 1189.5665 1216.4855 1231.0504 1279.9462 1306.5077 1322.0532 1327.7077 1339.6076 1362.2374 1374.5128 1382.3006 1392.2785 1439.7699 1454.7160 1466.7416 1466.8511 1476.0447 1478.8810 1485.7478 1485.8430 1590.5515 1592.0661 1615.2870 2974.3901 2976.7257 2981.2741 2987.8590 3012.9642 3037.6634 3042.1772 3054.2152 3067.6466 3076.5389 3083.0139 3086.8395 3112.8160 3123.0713 3136.7519 3151.8316 3163.8076
redmass: 2.7595 4.0928 3.8141 3.5493 3.5500 4.4722 3.0070 2.4936 1.7136 1.8198 1.2815 2.5552 2.3377 2.7054 2.8111 2.4161 3.2967 3.5794 3.1963 3.9427 2.8315 6.1559 1.7569 2.7735 2.1768 3.0970 1.2498 2.0935 5.1796 1.3670 1.1931 1.3579 1.8543 1.5339 1.4657 1.9855 3.0403 1.6046 2.9248 2.0776 2.4580 1.6174 2.5658 1.9672 1.0674 1.1890 1.4877 1.2648 2.0182 1.2006 1.3464 1.3273 1.3954 1.5647 1.4815 1.3382 1.1932 6.6324 1.2107 2.0522 1.1390 1.0479 1.0474 1.1782 1.0494 1.5922 1.2159 7.3594 6.0486 6.1294 1.0351 1.0357 1.0576 1.0613 1.0847 1.0895 1.0996 1.1069 1.0998 1.0984 1.1006 1.0999 1.0864 1.0868 1.0927 1.0957 1.1003
irintensity: 0.0887 0.0878 0.1897 0.1902 0.8928 3.3508 9.3379 2.4111 0.6478 1.2225 0.3728 3.9242 0.6323 2.6357 0.1883 1.2445 0.4580 3.1413 0.5879 10.5048 25.1826 1.0990 56.8703 20.9734 31.9018 38.4732 0.6877 3.7544 156.5702 2.7244 1.1802 19.3766 40.3934 4.4035 2.8713 10.5040 0.1415 2.4310 69.6303 10.4783 25.1051 13.0260 6.8873 0.5724 0.3965 4.5899 6.0174 0.2358 0.0409 5.9913 0.4133 0.2927 3.0749 2.1732 2.1712 25.4312 15.6183 1.0105 8.3776 4.8899 17.3586 6.8806 0.1808 11.0467 11.5149 46.0465 6.7146 0.6368 0.5853 8.3892 27.7801 39.8490 21.6264 49.7692 2.0372 13.8712 27.5973 48.9564 1.8541 93.7784 23.2015 42.5969 8.9342 1.1393 32.0556 34.6967 14.7866
temp: 298.150 k
press: 1.00000 atm
elementType: 8 7 6 6 6 6 6 6 6 6 6 6 6 6 1 1 1 1 1 1 1 1 1 1 1 1 1 1 1 1 1
symmnumber: 1
zpe: 686426.5 jmol-1
zpe.correction: 0.261446 hartree
zpe.thermalcorrener: 0.276504 hartree
zpe.thermalcorrenthalpy: 0.277448 hartree
zpe.thermalcorrgfe: 0.215865 hartree
zpe.sumelectzpe: -596.327820 hartree
zpe.sumelectthermal: -596.312762 hartree
zpe.sumelectthermalent: -596.311818 hartree
zpe.sumelectthermalfe: -596.373401 hartree
dipole: -1.1648 0.1174 0.1043
dipole: 1.1753
quadrupole: -74.1388 -78.2458 -86.7648
quadrupole: -4.0806 -4.2944 1.9558
quadrupole: 5.5777 1.4706 -7.0483 -4.0806 -4.2944 1.9558
hfenergy: -596.5892661 hartree
pointgroup: C01 [X(C12H17N1O1)]
dipole: 0.4554021 0.0558901 -0.0573827 debye
polarizability: 188.7340739|4.3774873|140.5964649|-19.3973953|-12.7322661|97.5934473 unknown
InChI: InChI=1S/C12H17NO/c1-11(2)10-13-14-9-8-12-6-4-3-5-7-12/h3-7,10-11H,8-9H2,1-2H3
charge 0 multiplicity 1
31 atoms
O  0.818198 -0.85069 -0.269636
N  2.105466 -0.662738 0.426405
C  -1.379881 -1.888845 -0.140528
C  4.276936 0.443889 0.238816
C  -2.296026 -0.67262 -0.076132
C  -0.026216 -1.726519 0.574843
C  5.356105 -0.088491 -0.741313
C  4.411999 1.977174 0.437699
C  2.89344 0.107056 -0.2770
C  -3.544789 -0.749497 0.59271
C  -1.928996 0.557588 -0.684547
C  -4.407775 0.369333 0.655709
C  -2.788369 1.676686 -0.622583
C  -4.031957 1.587966 0.046672
H  -1.1701 -2.161007 -1.194068
H  -1.889514 -2.759103 0.315276
H  4.401835 -0.057614 1.2174
H  0.479018 -2.706173 0.681025
H  -0.141315 -1.269347 1.575368
H  5.247286 0.375176 -1.740278
H  5.281968 -1.183822 -0.861206
H  6.367445 0.151935 -0.364995
H  4.274617 2.51438 -0.52015
H  3.66157 2.355089 1.154317
H  5.417493 2.226153 0.824045
H  2.582802 0.528755 -1.249696
H  -3.845627 -1.693135 1.065612
H  -0.96255 0.629348 -1.194139
H  -5.369135 0.288701 1.176179
H  -2.489605 2.618761 -1.097061
H  -4.698726 2.456614 0.09196
