program: Gaussian 09
title: 000275320
version: EM64L-G09RevD.01
frameworkgroup: C1[X(C6H12N2O3)]
method: RPBEPBE
basis: SDD
operation: Freq
keyword: #p
keyword: freq=noraman
keyword: PBEPBE/SDD
title: #p freq=noraman PBEPBE/SDD
converged: YES YES NO NO
title: Mulliken charges:
elementType: O O O N N C C C C C C H H H H H H H H H H H H
charge: -0.207752 -0.305460 -0.246884 -0.308752 -0.061890 -0.231680 0.225132 -0.676719 -0.751384 0.143425 -0.492953 0.265505 0.195980 0.214225 0.223210 0.243422 0.317901 0.288374 0.208901 0.256785 0.242401 0.235396 0.222817
chargesum: 0.00000
title: Mulliken charges with hydrogens summed into heavy atoms:
elementType: O O O N N C C C C C C
charge: -0.207752 -0.305460 -0.246884 0.009149 -0.061890 0.229805 0.225132 0.004138 0.002676 0.143425 0.207660
polarizability: 1.31127573e+02 -5.82596475e+00 9.73013445e+01 5.99700643e-01 -3.63061817e+00 6.62301152e+01
1716.lowfreq: -4.6638 -0.0007 -0.0007 -0.0004 3.8328 10.1508 42.6695 52.3595 77.1238
frequency: 42.6204 52.3357 77.1164 84.9868 89.8824 107.9679 126.0746 131.8947 185.4605 226.8791 246.2545 284.6577 295.1296 352.8829 377.2577 428.0279 541.3113 567.3661 578.6301 655.7496 721.2072 753.5338 795.3437 824.7318 908.6918 966.6224 1004.7660 1015.2316 1042.1147 1048.3005 1112.6846 1116.2555 1129.4307 1136.6863 1174.1589 1243.1037 1311.6991 1355.5069 1391.5290 1395.2726 1419.8825 1445.9588 1448.2612 1452.7725 1460.5061 1468.8879 1478.4132 1482.3041 1488.1275 1627.0068 1655.9139 2991.0468 2996.4209 2997.7382 3000.0067 3073.4040 3095.7653 3096.0781 3096.7160 3109.1111 3112.2395 3133.7385 3559.9313
redmass: 4.5970 3.0750 1.5460 2.1325 1.9291 1.5443 1.8459 3.5680 4.4511 1.5470 2.6522 3.6944 3.3267 3.7990 1.2039 4.0307 5.4824 5.5255 3.7552 6.0857 9.0938 6.3078 3.0446 1.0862 5.8633 2.3954 7.8331 2.4317 1.5621 3.0069 1.2605 2.1996 1.4205 1.5179 4.3654 1.1914 2.2825 1.2704 1.2324 1.2501 1.1635 1.2243 1.0533 1.2835 1.0601 1.0531 1.1278 1.0580 1.0880 9.2580 9.7342 1.0582 1.0293 1.0384 1.0360 1.1040 1.0987 1.1007 1.1035 1.1025 1.0989 1.1046 1.0802
irintensity: 2.9231 0.9994 4.6314 7.1920 4.7412 2.1012 3.1619 2.2463 5.9715 5.2315 7.2734 7.7636 19.4145 19.7023 87.2695 4.7015 6.4253 0.6532 7.3229 13.7270 27.6340 26.5270 2.4024 3.6292 66.7537 25.7406 214.8972 22.3179 10.0962 32.8379 0.2081 28.3477 35.2594 61.9760 235.5349 1.0004 17.9916 3.3014 41.1750 31.6328 17.0223 85.5673 12.9909 54.6199 2.4339 11.0899 16.1531 5.8715 14.7525 124.6270 892.8115 47.8247 52.9658 20.5413 14.1514 2.4915 24.2969 21.2403 30.0989 35.8600 4.5701 20.4818 59.2680
temp: 298.150 k
press: 1.00000 atm
elementType: 8 8 8 7 7 6 6 6 6 6 6 1 1 1 1 1 1 1 1 1 1 1 1
symmnumber: 1
zpe: 482032.8 jmol-1
zpe.correction: 0.183597 hartree
zpe.thermalcorrener: 0.197392 hartree
zpe.thermalcorrenthalpy: 0.198336 hartree
zpe.thermalcorrgfe: 0.142052 hartree
zpe.sumelectzpe: -570.063644 hartree
zpe.sumelectthermal: -570.049849 hartree
zpe.sumelectthermalent: -570.048904 hartree
zpe.sumelectthermalfe: -570.105189 hartree
dipole: -1.2333 4.3677 0.1240
dipole: 4.5402
quadrupole: -52.8372 -60.8874 -69.0894
quadrupole: 3.0356 -6.3581 4.7619
quadrupole: 8.1008 0.0506 -8.1514 3.0356 -6.3581 4.7619
hfenergy: -570.2472406 hartree
pointgroup: C01 [X(C6H12N2O3)]
dipole: -0.4501183 1.6922922 -0.352378 debye
dipolederiv: -0.4762786 -0.0603314 0.0374292 -0.296642 -0.3392265 0.0866054 0.1002116 0.1547506 -0.2425546 -1.3366119 0.1846638 0.2936156 -0.052077 -0.4313485 0.1538848 0.6632522 0.0351681 -0.6658767 -0.7585092 0.2566913 -0.1194131 0.2648721 -0.7029828 0.3742579 -0.0729138 0.3100777 -0.7670371 -0.8351263 0.4758318 -0.082087 0.5107144 -0.172738 0.0405979 0.135766 -0.0220822 -0.3759761 -1.6290552 0.5466607 -0.1577932 0.8663822 -1.0028016 0.2133124 -0.4075511 0.3378991 -0.4607074 0.43032 0.0586827 -0.146933 0.2223137 0.4128296 -0.0762406 -0.4506302 -0.1145453 0.3527464 1.5343208 -0.4116676 0.2424741 -0.9044881 1.0610582 -0.1644343 0.4868443 -0.2674231 0.283306 -0.0520722 -0.1101599 0.0118802 -0.1313364 -0.0565018 -0.0222026 0.0791995 -0.0050491 0.0322303 -0.1562773 -0.2168672 0.006457 -0.0939857 -0.1632815 -0.0021222 -0.0642051 0.0299006 0.0142242 2.3782938 -0.7666373 -0.0427246 -0.3886842 0.8895207 -0.6452954 -0.3737035 -0.5239549 1.1750893 0.6483277 -0.0839988 -0.0792536 -0.126799 0.2854169 0.0466063 -0.0046624 0.0210393 0.2624421 0.0330154 0.0491766 -0.0887625 0.0200993 0.0302752 0.0393889 -0.0232999 0.0415187 0.0000384 -0.0158158 0.0214073 0.0860861 0.0663044 -0.1059143 -0.1172778 0.133996 -0.0447375 -0.054759 0.0365615 -0.0624636 0.058688 -0.0878731 0.0437362 0.0811646 0.0775207 0.094389 -0.0496076 -0.0494933 0.0509768 -0.0951476 0.0969425 0.0419323 0.0600657 -0.137403 0.0190611 0.0382009 0.0568899 0.0831913 0.0644139 0.0619222 0.0057604 -0.0882445 0.0200529 -0.1138189 0.0244152 0.1518993 -0.0944365 -0.0204536 -0.1310719 0.11931 0.0258587 -0.0716764 0.031813 0.3115132 0.0355819 -0.0249592 0.0726895 0.008932 0.106082 -0.0348941 0.0637468 -0.0041787 0.0537018 0.0203114 0.1415086 -0.0419316 0.0875103 -0.0954444 0.0403767 -0.0349934 0.0488007 0.1104369 0.0637876 -0.0227007 -0.0631369 -0.0210468 0.0734804 0.0300481 -0.0783896 -0.0272623 -0.0426299 0.0009083 -0.0196984 0.0143524 0.070221 -0.1284663 -0.0533032 -0.0271583 -0.0037831 0.1003268 -0.0528829 0.0055865 -0.0317358 0.0104797 0.0542579 -0.0704508 -0.1453041 -0.0571992 -0.0642113 -0.0280949 -0.0004568 0.0812863 -0.0526898 0.0750459 0.0822982 0.1313007 0.0596164 -0.0353119 unknown
polarizability: 130.8768762|-6.2191159|94.2344096|1.9911831|-10.3036828|69.5477466 unknown
InChI: InChI=1S/C6H12N2O3/c1-4-11-8-5(2)7-6(9)10-3/h8H,4H2,1-3H3
charge 0 multiplicity 1
23 atoms
O  -2.47108 0.359893 -0.746936
O  2.3279 -0.164611 -0.5838
O  1.758456 -1.398337 1.327108
N  -1.521954 1.382331 -0.423678
N  0.12846 -0.133966 0.197502
C  -2.98857 -0.308462 0.501735
C  -0.211218 1.100318 -0.104694
C  -3.973749 -1.362586 0.007071
C  0.690845 2.328226 -0.05752
C  1.411178 -0.601618 0.420484
C  3.681382 -0.750802 -0.476521
H  -2.12697 -0.75233 1.0285
H  -3.47353 0.460276 1.134652
H  -4.399653 -1.904793 0.870499
H  -4.802206 -0.903747 -0.560262
H  -3.462781 -2.093385 -0.642141
H  -1.816033 2.308043 -0.73829
H  1.506111 2.197396 -0.787175
H  0.144149 3.260744 -0.281286
H  1.147058 2.423725 0.942799
H  3.628959 -1.851412 -0.534397
H  4.15476 -0.466985 0.479258
H  4.236985 -0.338116 -1.331809
