program: Gaussian 09
title: 000275310
version: EM64L-G09RevD.01
frameworkgroup: C1[X(C14H16N2O)]
method: RPBEPBE
basis: SDD
operation: Freq
keyword: #p
keyword: freq=noraman
keyword: PBEPBE/SDD
title: #p freq=noraman PBEPBE/SDD
converged: YES YES NO NO
title: Mulliken charges:
elementType: O N N C C C C C C C C C C C C C C H H H H H H H H H H H H H H H H
charge: -0.404601 -0.147854 -0.066201 -0.402849 -0.371962 -0.378091 -0.382586 -0.412266 0.218838 -0.321349 -0.203850 0.454367 -0.310280 0.220426 -0.440371 -0.405286 -0.237382 0.219680 0.189167 0.196662 0.207470 0.210850 0.199089 0.206882 0.203910 0.299730 0.193873 0.214368 0.236089 0.229347 0.212720 0.223197 0.348264
chargesum: 0.00000
title: Mulliken charges with hydrogens summed into heavy atoms:
elementType: O N N C C C C C C C C C C C C C C
charge: -0.056338 -0.147854 -0.066201 0.005998 0.032171 0.031848 0.028206 0.081337 0.218838 -0.106981 -0.203850 0.454367 -0.074191 0.220426 -0.211025 -0.192565 -0.014185
polarizability: 2.85965346e+02 -5.54571339e+00 1.74897082e+02 -1.16581716e+01 -2.37672206e+00 8.98887106e+01
1716.lowfreq: -11.8664 -0.0005 0.0000 0.0003 3.4101 11.0023 25.4086 45.6962 76.7839
frequency: 24.5120 45.1229 76.7816 112.0729 159.4595 193.6837 196.2351 246.1682 288.1289 290.2938 318.3734 381.3639 387.7527 420.8865 426.2673 442.7095 453.3847 504.3145 518.3609 529.1296 538.0057 561.7496 567.7321 655.6849 689.7047 700.4934 742.9599 795.2952 801.9467 809.1223 819.9183 842.9919 848.2108 855.4516 860.2402 900.8769 943.7485 946.4433 955.1930 968.4070 1016.4537 1018.8984 1048.2969 1070.8841 1087.0204 1124.3537 1137.7036 1143.9108 1156.3759 1168.0374 1195.5343 1224.4286 1234.8670 1250.5942 1260.9302 1268.1627 1274.7152 1316.8180 1326.6837 1338.4949 1343.7710 1345.7338 1353.3768 1370.9421 1395.7368 1418.4161 1438.8308 1453.3107 1460.8060 1464.0964 1469.6416 1475.2618 1486.3014 1513.5133 1554.7681 1606.5014 1624.0777 2927.4810 2933.3258 2965.6881 2983.0603 2986.1893 3033.4663 3044.3793 3053.2750 3087.1652 3094.2146 3107.5044 3124.7160 3127.1289 3157.9600 3168.6586 3562.2824
redmass: 3.7506 3.3355 4.6137 3.9221 4.9375 3.5981 3.0446 2.2981 3.1997 4.9477 3.4993 1.6122 1.2831 3.1570 3.7721 3.5202 3.5989 3.3134 3.8747 3.6006 5.2446 3.0060 3.6332 4.1110 3.8463 7.2585 1.3413 2.5147 1.6685 3.9109 2.1111 1.6120 3.0539 4.5876 1.4825 2.4703 1.3074 1.3227 3.1981 1.3764 2.5581 3.1934 1.9918 2.0387 1.4112 2.4921 2.0728 1.3856 1.3060 1.1506 1.4169 2.1516 1.8143 1.3891 1.3677 1.9350 1.2958 2.8071 1.2802 1.4613 1.4755 1.4886 1.6837 2.7038 2.3004 5.9716 2.7862 1.0954 1.0873 1.1334 1.0864 1.3267 2.3279 3.6528 6.4717 6.3737 7.3878 1.0717 1.0705 1.0633 1.0608 1.0612 1.0964 1.1029 1.1033 1.0922 1.0895 1.0888 1.0892 1.0890 1.0984 1.0943 1.0656
irintensity: 0.8820 0.0313 0.2269 1.1170 13.2547 1.3942 2.2368 0.6266 3.4642 1.6257 6.8743 48.9636 67.6772 2.0845 2.4674 0.6382 0.7127 2.4858 1.4644 1.2894 5.0189 3.8219 0.7411 0.7543 2.2280 10.2786 62.9019 20.2953 0.2599 7.1077 55.0091 8.0834 21.0858 13.8965 4.2689 6.3350 0.6606 4.9534 44.2960 3.1546 17.8820 124.0127 17.6047 1.5126 2.2457 12.5931 27.9760 24.0471 17.6038 5.3840 80.0682 23.9306 80.2506 55.0381 60.1380 61.3471 0.9730 14.3042 2.2049 5.6395 12.8777 2.8222 66.9143 31.6392 25.2447 22.5095 106.4923 7.3088 12.9560 43.7934 8.6632 31.9971 36.2834 218.2576 129.5579 199.3587 154.5373 49.2437 118.1647 48.3772 39.9196 31.6815 77.7690 33.2987 100.3409 11.4286 22.3734 21.2893 3.8246 15.5251 35.7435 25.8781 25.3283
temp: 298.150 k
press: 1.00000 atm
elementType: 8 7 7 6 6 6 6 6 6 6 6 6 6 6 6 6 6 1 1 1 1 1 1 1 1 1 1 1 1 1 1 1 1
symmnumber: 1
zpe: 715450.1 jmol-1
zpe.correction: 0.272501 hartree
zpe.thermalcorrener: 0.286774 hartree
zpe.thermalcorrenthalpy: 0.287718 hartree
zpe.thermalcorrgfe: 0.230753 hartree
zpe.sumelectzpe: -726.584696 hartree
zpe.sumelectthermal: -726.570423 hartree
zpe.sumelectthermalent: -726.569478 hartree
zpe.sumelectthermalfe: -726.626444 hartree
dipole: 1.0849 -0.9368 0.1168
dipole: 1.4381
quadrupole: -80.3834 -88.2525 -104.8031
quadrupole: -6.6509 -1.9011 0.1380
quadrupole: 10.7629 2.8938 -13.6568 -6.6509 -1.9011 0.1380
hfenergy: -726.8571968 hartree
pointgroup: C01 [X(C14H16N2O1)]
dipole: -0.4237389 0.3730902 -0.0371622 debye
polarizability: 284.3899912|-3.4705892|173.2505138|21.2062824|-12.3142487|93.1106332 unknown
InChI: InChI=1S/C14H16N2O/c17-12-6-4-5-11-7-8-13(15-14(11)12)16-9-2-1-3-10-16/h4-8,17H,1-3,9-10H2
charge 0 multiplicity 1
33 atoms
O  1.922261 -2.618473 0.397638
N  -2.015202 0.115766 -0.522366
N  0.200305 -0.53474 -0.117616
C  -4.750722 -0.561991 0.274352
C  -4.266516 0.905004 0.199702
C  -3.561862 -1.508029 0.566501
C  -3.112396 1.051792 -0.823731
C  -2.426814 -1.305946 -0.462175
C  -0.675197 0.472049 -0.372217
C  -0.224739 1.84839 -0.478136
C  1.534892 -0.249917 0.046635
C  2.073993 1.090964 -0.038204
C  1.123763 2.133056 -0.311363
C  2.459568 -1.324746 0.317331
C  3.471114 1.33426 0.139684
C  3.827363 -1.063322 0.488374
C  4.33535 0.267511 0.399935
H  -5.535299 -0.669751 1.046964
H  -5.212559 -0.843653 -0.695315
H  -5.097226 1.576813 -0.091939
H  -3.906897 1.2300 1.195556
H  -3.165862 -1.310556 1.581673
H  -3.890474 -2.564773 0.539706
H  -3.505665 0.83469 -1.842437
H  -2.74878 2.089879 -0.830462
H  -1.531691 -1.895049 -0.210804
H  -2.781711 -1.618189 -1.46974
H  -0.921865 2.662229 -0.690114
H  1.477144 3.168185 -0.390325
H  3.852025 2.359903 0.069608
H  4.518224 -1.89269 0.693158
H  5.407752 0.440589 0.537906
H  2.644826 -3.269655 0.585319
