program: Gaussian 09
title: 000275291
version: EM64L-G09RevD.01
frameworkgroup: C1[X(C9H11Br2NO2S)]
method: RPBEPBE
basis: SDD
operation: Freq
keyword: #p
keyword: freq=noraman
keyword: PBEPBE/SDD
title: #p freq=noraman PBEPBE/SDD
converged: YES YES NO NO
title: Mulliken charges:
elementType: Br Br S O O N C C C C C C C C C H H H H H H H H H H H
charge: -0.013449 0.011797 0.933347 -0.520096 -0.541619 -0.488751 -0.063972 0.013641 -0.678637 -0.655440 -0.272271 -0.223558 -0.199869 -0.201769 -0.214549 0.289345 0.321963 0.342715 0.282517 0.281652 0.296915 0.295461 0.277077 0.243668 0.243929 0.239950
chargesum: 0.00000
title: Mulliken charges with hydrogens summed into heavy atoms:
elementType: Br Br S O O N C C C C C C C C C
charge: -0.013449 0.011797 0.933347 -0.520096 -0.541619 -0.166788 0.225373 0.013641 -0.053404 -0.076872 0.023191 0.053520 0.043799 0.042160 0.025401
polarizability: 2.13041293e+02 2.76547892e+01 1.30446575e+02 8.54511826e+00 -2.15145731e+00 1.39525110e+02
1716.lowfreq: -8.9408 -6.3170 -0.4489 -0.0011 0.0011 0.0016 6.1084 21.6794 27.0275
frequency: -6.4257 21.5959 27.0062 49.8856 53.9255 72.3014 125.4528 139.2909 151.9953 171.8861 218.3608 247.0340 266.1816 284.1170 320.0269 362.1275 396.2643 402.4792 443.0460 464.5155 494.1313 505.4333 571.7878 601.5037 654.2342 682.0922 687.7421 760.1161 796.1146 802.8943 838.5187 845.9348 877.6205 918.8527 932.8481 945.6461 976.9031 983.1120 1006.2846 1008.2998 1031.4733 1039.3156 1046.3369 1077.7148 1166.6133 1173.6139 1178.6590 1180.4935 1200.4150 1242.7871 1272.5016 1299.6225 1303.9080 1377.9643 1384.7306 1436.3034 1437.9416 1443.8913 1452.3395 1576.6027 1604.7844 2995.6477 3052.9407 3059.0266 3139.8885 3144.6505 3149.6647 3150.6157 3159.6198 3169.1315 3178.2643 3345.5412
redmass: 7.1829 10.5533 4.6544 13.1966 5.8653 10.1862 6.3043 8.1761 5.1157 5.6116 4.7415 8.3352 7.5327 4.1926 3.5090 5.9496 7.4928 2.8654 6.4662 3.1318 4.3833 4.5883 3.6760 6.4794 6.2384 3.6740 2.3315 1.4535 9.9184 2.2890 1.6147 1.2483 1.7127 3.7377 1.3657 4.7591 5.6421 1.4218 1.3377 4.1382 1.6242 1.6280 2.1299 1.5449 1.4631 1.0687 1.1442 1.3920 1.2239 1.2061 1.2481 1.3373 1.3012 1.1961 8.2433 1.1180 2.1638 1.0964 2.0248 5.8221 6.9631 1.0824 1.0570 1.0573 1.0860 1.1110 1.1099 1.0888 1.0930 1.0971 1.1012 1.0743
irintensity: 1.3215 0.8699 0.3886 0.9299 2.2680 0.5440 4.0416 1.8803 1.3134 6.8471 1.7414 8.5894 8.7619 4.0537 3.8531 4.5243 15.8017 0.4403 55.6043 46.6943 22.2388 92.5610 0.5484 0.0684 4.6432 55.5138 34.3446 80.9938 70.1477 162.9925 10.4917 0.7558 12.1109 38.4875 3.4823 28.7857 1.5350 0.2637 0.0648 0.3470 8.2736 6.7958 25.9609 4.6961 43.2719 0.6715 3.3942 0.6243 6.4977 19.6644 50.0963 5.6451 2.2974 15.6894 6.9769 17.6680 12.2727 15.8734 12.9463 1.9173 0.3772 2.2108 12.4824 16.5336 1.3022 1.0897 4.2307 10.0574 1.7639 7.2088 19.2119 41.3980
temp: 298.150 k
press: 1.00000 atm
elementType: 35 35 16 8 8 7 6 6 6 6 6 6 6 6 6 1 1 1 1 1 1 1 1 1 1 1
symmnumber: 1
zpe: 487960.1 jmol-1
zpe.correction: 0.185854 hartree
zpe.thermalcorrener: 0.201525 hartree
zpe.thermalcorrenthalpy: 0.202469 hartree
zpe.thermalcorrgfe: 0.138889 hartree
zpe.sumelectzpe: -978.424371 hartree
zpe.sumelectthermal: -978.408701 hartree
zpe.sumelectthermalent: -978.407757 hartree
zpe.sumelectthermalfe: -978.471336 hartree
dipole: 2.6136 3.4837 1.7773
dipole: 4.7038
quadrupole: -96.7378 -137.0571 -110.1817
quadrupole: -1.0018 -0.5242 -1.5388
quadrupole: 17.9210 -22.3982 4.4772 -1.0018 -0.5242 -1.5388
hfenergy: -978.6102255 hartree
pointgroup: C01 [X(C9H11Br2N1O2S1)]
dipole: -0.9314109 1.5509795 -0.3895858 debye
dipolederiv: -0.470454 0.0954446 -0.0537324 0.1119881 -0.1656341 0.0248143 -0.1616508 0.0588936 -0.2013505 -0.2703967 0.2098684 0.082436 0.1165883 -0.282141 -0.0848254 0.0435378 -0.0890704 -0.1403831 2.1176761 0.2159961 0.1158427 0.1100067 1.4402466 0.0287747 0.0502353 0.0618882 1.0797128 -0.7072672 -0.0272365 -0.0468955 -0.0411168 -0.6850905 0.0207254 0.0348643 0.2023715 -0.4770159 -0.8250368 -0.0334019 0.0363092 -0.0287179 -0.5621798 -0.0314445 0.0211036 -0.179523 -0.6707663 -0.8061674 -0.2108991 0.0280785 -0.1370339 -0.5003152 -0.0446183 0.1030215 -0.0332284 -0.4578323 0.088343 0.2446641 -0.0455375 0.2106282 0.3019433 0.0168401 -0.617101 -0.2265633 -0.0074331 0.0400691 -0.0527821 0.0212187 -0.0668595 -0.1881787 0.0047476 0.0039159 -0.0066796 -0.067747 0.53611 -0.2598924 0.2368586 -0.2193694 -0.0589934 -0.2013274 0.4343446 -0.1596974 0.2185922 0.318592 -0.4329285 -0.1243546 -0.2892641 0.3247082 0.0672329 0.0155952 0.226033 0.165264 -0.2109019 0.0163603 -0.1277221 0.0251332 -0.1042889 0.0678622 0.2080815 -0.0576058 -0.0627366 -0.1887043 0.0078468 0.1258014 0.0710212 -0.076634 -0.055526 -0.1578147 0.047895 -0.0211246 -0.0660632 -0.0459125 0.1323765 -0.0493503 -0.0939851 -0.0887291 0.0309694 -0.0357633 0.078076 -0.0493702 -0.0291722 -0.1552211 -0.0519268 -0.1032737 0.0616702 -0.0456711 0.0084799 0.0658503 0.0984447 -0.1190273 -0.0036626 -0.1155053 -0.0666872 -0.0084452 -0.000247 -0.0091576 -0.0055054 -0.0214908 0.0347277 -0.0835762 0.0575572 0.0942084 -0.0049912 0.0614332 0.0208274 0.0368278 0.1774908 0.0280966 -0.0801915 -0.1286698 0.0464693 0.0220517 -0.0223106 0.0286667 0.2500644 0.0811714 0.0472118 -0.0987589 0.105199 0.0243153 -0.0063134 -0.0778811 -0.0220449 0.0314162 -0.0766274 -0.009413 -0.0278346 -0.0335606 0.0228676 0.1272417 0.008265 0.1204955 -0.0075922 -0.0609768 -0.0222553 0.075362 -0.0473422 -0.0430053 -0.0139786 0.0805983 0.0240422 0.0215736 0.0121193 0.0821596 -0.034539 0.1087525 0.0432947 0.052182 -0.0225554 -0.0240482 0.0144369 0.1546214 0.0219655 0.0742342 0.0154679 0.1403058 -0.0194992 0.0454457 -0.00223 0.0795476 0.1224569 0.0360102 -0.0560565 0.0261428 0.126796 0.0317739 -0.0491638 0.0144251 0.0551971 0.0372158 0.0563052 -0.0571575 0.0707413 0.1285114 0.046122 -0.0661166 0.0451914 -0.042376 0.0272834 0.0479917 0.0690775 0.067628 0.1333797 -0.019001 0.0795788 -0.0179367 -0.0336121 -0.0581372 0.0982727 -0.0023554 0.1118621 0.1033607 0.0066605 -0.000478 0.0043391 0.0989161 unknown
polarizability: 209.4596579|-33.1319327|133.2945699|4.5173244|-1.6519917|140.2587509 unknown
InChI: InChI=1S/C9H11Br2NO2S/c10-6-8(7-11)12-15(13,14)9-4-2-1-3-5-9/h1-5,8,12H,6-7H2
charge 0 multiplicity 1
26 atoms
Br 4.735598 -0.431191 0.366311
Br 0.803096 3.146984 0.96091
S  0.279911 -1.420366 -0.102693
O  0.268839 -2.660572 0.946301
O  0.716679 -1.613608 -1.670351
N  1.382811 -0.156582 0.712685
C  2.073042 0.758421 -0.226812
C  -1.388705 -0.540845 -0.111135
C  3.293539 0.13965 -0.949492
C  2.441769 2.054896 0.518673
C  -1.917063 -0.172429 -1.357859
C  -2.036358 -0.33352 1.117196
C  -3.182149 0.46073 -1.366036
C  -3.298804 0.301032 1.084798
C  -3.865705 0.697046 -0.150749
H  1.355474 1.011701 -1.033785
H  2.038564 -0.71165 1.299136
H  3.001312 -0.77735 -1.483008
H  3.786715 0.856451 -1.624108
H  3.065546 2.708615 -0.111043
H  2.937316 1.859185 1.479969
H  -1.365489 -0.388181 -2.278677
H  -1.578589 -0.652397 2.058251
H  -3.629326 0.763057 -2.318478
H  -3.835016 0.485061 2.021262
H  -4.844811 1.18766 -0.165568
