program: Gaussian 09
title: 000275271
version: EM64L-G09RevD.01
frameworkgroup: C1[X(C20H13N3S2)]
method: RPBEPBE
basis: SDD
operation: Freq
keyword: #p
keyword: freq=noraman
keyword: PBEPBE/SDD
title: #p freq=noraman PBEPBE/SDD
converged: YES YES NO NO
title: Mulliken charges:
elementType: S S N N N C C C C C C C C C C C C C C C C C C C C H H H H H H H H H H H H H
charge: 0.209153 0.195301 0.001523 -0.345632 0.013667 0.451132 0.407736 -0.086744 -0.347410 -0.346959 -0.345740 -0.395478 -0.286058 -0.272990 -0.242116 -0.251694 -0.228795 -0.228263 -0.305846 0.355278 -0.200912 -0.273191 -0.332179 -0.242592 -0.212301 0.277338 0.289692 0.248762 0.253575 0.234156 0.239621 0.233471 0.239550 0.336702 0.243041 0.256841 0.228831 0.229527
chargesum: 0.00000
title: Mulliken charges with hydrogens summed into heavy atoms:
elementType: S S N N N C C C C C C C C C C C C C C C C C C C C
charge: 0.209153 0.195301 0.001523 -0.008930 0.013667 0.451132 0.407736 -0.086744 -0.347410 -0.346959 -0.068402 -0.105786 -0.037295 -0.019415 -0.007960 -0.012073 0.004675 0.011287 -0.305846 0.355278 -0.200912 -0.030150 -0.075338 -0.013761 0.017227
polarizability: 5.01303735e+02 4.60672900e+00 3.37097040e+02 2.10478763e+01 8.76206651e+00 1.29395236e+02
1716.lowfreq: -4.5614 -0.0017 -0.0017 -0.0010 2.7262 8.5032 20.9034 31.4444 33.4136
frequency: 20.8280 31.4387 33.3684 52.5058 87.1142 101.9782 127.9836 158.4275 166.3997 180.1369 191.9277 220.1362 256.8130 287.3827 315.4168 324.0455 334.2576 367.5162 402.7851 428.0348 431.3598 432.0113 444.1675 449.3419 477.1819 482.6242 510.9978 515.4743 531.2216 574.0086 577.5242 596.1527 618.0972 629.3772 651.1972 658.5772 673.2174 691.3144 723.3867 727.5885 731.0650 747.3551 760.1402 764.1140 773.2833 798.5192 858.7566 871.4088 881.3182 882.7581 937.0531 939.4137 954.6986 964.5331 979.7323 988.6911 991.9146 1012.1924 1020.6216 1024.6968 1034.5592 1035.5589 1055.3575 1059.7113 1112.7980 1120.0116 1132.4022 1144.6431 1168.8140 1174.4666 1178.7002 1187.5246 1243.2384 1249.8083 1270.9826 1289.3965 1326.0726 1364.8493 1372.0103 1376.4696 1421.4502 1424.1952 1433.8912 1444.0150 1452.9047 1460.3833 1496.8581 1523.6316 1561.4652 1563.8106 1577.2283 1579.5734 1590.6768 1602.8906 1626.5863 3130.9733 3134.0657 3135.0683 3139.2863 3145.8931 3149.1647 3152.4279 3160.7886 3164.3669 3170.2434 3173.7949 3175.6114 3398.5037
redmass: 7.2551 6.7617 6.0181 6.5787 5.8361 5.2211 5.0784 6.2481 6.2082 5.9047 6.1032 5.6043 6.0076 6.3472 6.0106 5.2947 6.3334 6.7412 8.9106 4.3087 5.4209 3.6697 9.4639 3.6839 4.7900 8.5045 6.1237 4.1121 5.6360 6.0439 5.5249 1.4860 7.3202 6.6954 4.3475 6.0664 6.9578 6.9113 4.6304 2.7986 5.9842 2.7876 1.4774 1.2936 1.6091 6.1364 1.3792 1.3926 1.4987 4.4510 6.6017 1.3848 1.3872 1.3881 1.3145 1.3379 1.3244 3.4179 4.2995 5.1767 3.2851 3.7379 2.6147 2.8424 1.8038 1.8144 2.0157 2.0794 1.1023 1.0597 1.0761 2.8157 1.7822 1.6728 1.4726 2.2484 2.5395 9.3491 4.3843 8.8681 2.1991 2.3267 3.0123 2.6880 2.3882 2.5128 1.8415 4.0816 6.2544 6.5600 7.0092 7.6854 6.0871 6.4252 9.3552 1.0865 1.0858 1.0855 1.0888 1.0905 1.0906 1.0944 1.0951 1.0958 1.1009 1.0998 1.0993 1.0758
irintensity: 0.0160 0.1593 0.6341 2.0379 0.1146 0.5377 1.6863 1.7395 1.5172 0.2951 3.3228 4.2459 3.9971 3.0079 2.8342 0.5939 7.2993 6.4720 3.1611 6.1318 0.0198 10.0324 3.0696 2.7517 21.0498 3.0144 7.3100 0.4589 3.5785 8.2168 5.4980 68.5320 7.6397 13.6039 7.7844 2.8635 6.9373 6.4726 3.3755 14.3122 6.6916 53.4959 81.3305 24.9141 86.4661 33.9167 1.3478 0.2341 11.8558 41.0616 14.9830 3.1868 3.9750 5.4832 0.1085 1.4187 5.3411 6.5230 141.6928 36.6309 6.4289 3.4608 22.6866 5.9691 92.4407 5.7048 33.8695 159.2042 1.4348 2.6378 14.8116 105.2454 2.5315 10.6386 5.2284 5.1395 34.8642 8.3420 3.3125 0.4158 29.0758 50.4950 21.7997 35.2389 16.1327 30.0653 58.5015 63.7888 33.1370 173.3936 148.2907 256.8307 22.9952 1.0921 446.8969 0.9508 0.3819 2.2437 1.7187 8.7448 10.8683 10.9321 17.7914 22.8469 25.3893 19.6601 21.6941 51.6454
temp: 298.150 k
press: 1.00000 atm
elementType: 16 16 7 7 7 6 6 6 6 6 6 6 6 6 6 6 6 6 6 6 6 6 6 6 6 1 1 1 1 1 1 1 1 1 1 1 1 1
symmnumber: 1
zpe: 725252.2 jmol-1
zpe.correction: 0.276234 hartree
zpe.thermalcorrener: 0.296008 hartree
zpe.thermalcorrenthalpy: 0.296952 hartree
zpe.thermalcorrgfe: 0.226268 hartree
zpe.sumelectzpe: -1728.599859 hartree
zpe.sumelectthermal: -1728.580085 hartree
zpe.sumelectthermalent: -1728.579141 hartree
zpe.sumelectthermalfe: -1728.649825 hartree
dipole: -1.3174 -2.3540 0.8033
dipole: 2.8147
quadrupole: -137.7679 -135.7082 -164.3021
quadrupole: 0.4500 0.9445 0.5700
quadrupole: 8.1582 10.2178 -18.3760 0.4500 0.9445 0.5700
hfenergy: -1728.876093 hartree
pointgroup: C01 [X(C20H13N3S2)]
dipole: 0.4407231 0.9780358 0.2747534 debye
polarizability: 499.3199853|17.1585464|337.7511042|-21.8890353|-19.1395042|130.7249211 unknown
InChI: InChI=1S/C20H13N3S2/c1-4-10-16-13(7-1)19(14-8-2-5-11-17(14)24-16)22-23-20-21-15-9-3-6-12-18(15)25-20/h1-12,23H
charge 0 multiplicity 1
38 atoms
S  4.237275 0.595227 -1.277092
S  -3.39127 1.530769 -0.54199
N  0.185587 -0.338259 0.097251
N  -0.817059 0.602672 -0.037791
N  -2.635908 -0.984487 0.183993
C  2.44167 -1.059143 0.193121
C  1.959515 1.459174 0.198371
C  1.458033 0.054295 0.158171
C  3.728384 -0.930661 -0.394251
C  3.183209 1.824834 -0.434643
C  2.097064 -2.304749 0.788644
C  1.266835 2.475089 0.92654
C  4.64729 -2.005631 -0.387659
C  3.63801 3.164917 -0.42746
C  3.003454 -3.380354 0.794715
C  1.722993 3.807063 0.946605
C  4.284042 -3.231793 0.206292
C  2.899873 4.160094 0.24379
C  -4.653737 0.239482 -0.319196
C  -4.038245 -1.003673 0.054495
C  -2.141412 0.20024 -0.081886
C  -6.045786 0.360561 -0.474567
C  -4.85348 -2.139713 0.270396
C  -6.84319 -0.787897 -0.253482
C  -6.250195 -2.023803 0.114698
H  1.097084 -2.404006 1.220941
H  0.392494 2.202866 1.52814
H  5.637057 -1.881397 -0.839733
H  4.580827 3.418776 -0.923584
H  2.717806 -4.331518 1.255833
H  1.172253 4.562231 1.516715
H  4.997588 -4.062618 0.213993
H  3.258148 5.194757 0.245842
H  -0.598427 1.585911 -0.250656
H  -6.50827 1.310361 -0.759694
H  -4.381426 -3.085075 0.552957
H  -7.929803 -0.716904 -0.370298
H  -6.886286 -2.900038 0.27978
