program: Gaussian 09
title: 000275232
version: EM64L-G09RevD.01
frameworkgroup: C1[X(C13H16N4O4)]
method: RPBEPBE
basis: SDD
operation: Freq
keyword: #p
keyword: freq=noraman
keyword: PBEPBE/SDD
title: #p freq=noraman PBEPBE/SDD
converged: NO YES NO NO
title: Mulliken charges:
elementType: O O O O N N N N C C C C C C C C C C C C C H H H H H H H H H H H H H H H H
charge: -0.207529 -0.207490 -0.261864 -0.261877 -0.158916 -0.159090 -0.391398 -0.391491 0.169905 0.169746 -0.204236 -0.204032 -0.764592 -0.764611 0.122704 0.122810 -0.352314 -0.352269 -0.374382 0.184421 0.184454 0.286964 0.286935 0.267713 0.236587 0.204902 0.267692 0.204868 0.236603 0.257664 0.192492 0.192505 0.257658 0.212972 0.275500 0.360500 0.360493
chargesum: 0.00000
title: Mulliken charges with hydrogens summed into heavy atoms:
elementType: O O O O N N N N C C C C C C C C C C C C C
charge: -0.207529 -0.207490 -0.261864 -0.261877 -0.158916 -0.159090 -0.030897 -0.030998 0.169905 0.169746 0.082728 0.082903 -0.055389 -0.055447 0.122704 0.122810 0.097842 0.097895 0.114090 0.184421 0.184454
polarizability: 2.01304453e+02 1.60746668e-02 1.43247933e+02 -1.55799296e+00 -1.29770846e-02 1.53766259e+02
1716.lowfreq: -12.6765 -0.0008 0.0003 0.0009 9.6608 11.0597 15.1254 53.4373 72.0279
frequency: -12.3809 53.4161 72.0099 130.3694 146.3777 164.1914 167.4543 185.1747 221.6206 229.6568 246.3334 266.2238 273.5109 293.3857 300.9937 335.3726 336.8851 346.9085 371.5891 379.3728 389.8886 397.9966 442.3253 463.8735 515.6377 526.6842 577.6993 588.8176 607.0608 646.7551 656.1941 682.6324 685.1070 702.7093 704.7516 737.6380 743.4875 770.8967 773.6631 815.8140 837.8873 862.3854 869.7568 881.7442 895.3792 949.5695 952.0960 966.5282 1022.0251 1048.9680 1079.8570 1086.8868 1101.5853 1111.0230 1151.7169 1155.3449 1169.6219 1175.0096 1193.6512 1200.1905 1224.4659 1238.5066 1245.0238 1266.5933 1276.3740 1290.3713 1313.9068 1331.9871 1339.3641 1347.7284 1358.3449 1362.3860 1371.0417 1372.0648 1383.5920 1397.4463 1419.8781 1433.9984 1454.0748 1456.6003 1456.8843 1460.9832 1465.2708 1478.2527 1489.5120 1612.1684 1632.7104 1642.6571 1655.2983 2991.4606 2994.6646 2995.1441 2997.0962 2999.8289 3000.6449 3010.6992 3068.2509 3080.0267 3080.0373 3085.9242 3086.8896 3107.9457 3114.6274 3516.2937 3516.8133
redmass: 8.1991 10.1889 5.5547 12.0666 9.5582 7.2329 3.4199 3.0520 1.0504 1.6682 3.1126 4.5867 2.0667 2.6639 5.7960 5.2687 1.9125 4.7380 7.2573 2.1714 5.8510 6.3607 7.5463 7.2513 4.5349 2.0981 4.7454 4.5051 5.1912 3.1095 2.6100 3.1185 5.1868 7.0185 7.7427 2.0529 3.0956 3.4729 1.7876 4.3346 1.8219 2.9995 2.6095 2.7442 2.0718 1.8288 2.4920 2.1357 2.3098 2.8662 2.4872 2.2744 1.9807 2.5157 5.4110 2.1593 4.1675 3.2216 2.7850 1.7454 1.4293 2.7350 2.3394 1.4759 2.4341 2.3250 1.7633 2.1176 1.4554 1.8963 1.4651 1.3952 1.6350 1.7278 1.2224 1.2034 2.3804 2.6520 1.1494 1.1398 1.0558 1.0977 1.0721 1.0528 1.0567 10.0643 10.7418 4.9794 5.0660 1.0370 1.0630 1.0382 1.0707 1.0783 1.0663 1.0863 1.0971 1.0996 1.0995 1.1018 1.0969 1.1005 1.1005 1.0764 1.0764
irintensity: 0.3385 0.0455 0.2950 0.1260 10.3802 1.3383 2.2082 3.5696 0.0775 0.0323 1.4122 1.5148 0.8546 2.0600 5.0147 1.9605 4.7984 17.3500 5.9235 17.2373 35.1172 0.1542 0.5873 3.0277 0.4347 5.3648 4.4859 3.5361 3.0446 2.0700 22.2693 1.1015 0.6257 1.7923 16.0790 78.4818 11.5957 91.2816 31.3343 2.4945 0.0070 6.4153 1.5812 5.9092 7.4916 2.3337 6.9058 9.3439 0.0216 2.5118 10.5269 11.0896 3.1707 7.1594 11.2254 4.6139 0.3085 3.6911 6.9052 97.7174 4.0546 3.2824 7.5719 1.3520 343.5480 7.5136 93.8777 83.3743 11.1477 37.2689 18.6709 18.4134 2.1896 1.5367 3.4916 41.1063 27.1299 265.1254 11.4817 94.8625 31.9284 24.7554 4.0818 5.0027 25.6611 85.3179 343.4456 118.7546 681.3555 5.1544 26.8327 10.4134 1.7578 15.7176 48.1560 78.6112 24.4057 9.2836 22.4590 8.7688 15.5870 0.0301 14.2249 24.5770 96.0248
temp: 298.150 k
press: 1.00000 atm
elementType: 8 8 8 8 7 7 7 7 6 6 6 6 6 6 6 6 6 6 6 6 6 1 1 1 1 1 1 1 1 1 1 1 1 1 1 1 1
symmnumber: 1
zpe: 766121.6 jmol-1
zpe.correction: 0.291800 hartree
zpe.thermalcorrener: 0.308665 hartree
zpe.thermalcorrenthalpy: 0.309609 hartree
zpe.thermalcorrgfe: 0.249302 hartree
zpe.sumelectzpe: -1023.383240 hartree
zpe.sumelectthermal: -1023.366375 hartree
zpe.sumelectthermalent: -1023.365431 hartree
zpe.sumelectthermalfe: -1023.425738 hartree
dipole: 1.6163 -0.0028 7.6718
dipole: 7.8402
quadrupole: -137.8902 -130.1523 -118.4864
quadrupole: 0.0100 2.0615 0.0001
quadrupole: -9.0472 -1.3093 10.3566 0.0100 2.0615 0.0001
hfenergy: -1023.67504 hartree
pointgroup: C01 [X(C13H16N4O4)]
dipole: -0.7950851 -0.0014992 2.9803409 debye
polarizability: 201.0051845|0.1813316|143.2484956|4.0666307|0.0243721|154.0649641 unknown
InChI: InChI=1S/C13H16N4O4/c1-12-6-7-13(12,2)9(19)15-11(21)17(7)5-3-4-16(6)10(20)14-8(12)18/h6-7,14-15H,3-5H2,1-2H3
charge 0 multiplicity 1
37 atoms
O  2.696004 1.629727 -1.081718
O  2.708853 -1.613004 -1.078763
O  -1.856804 2.331732 -1.585086
O  -1.838863 -2.345033 -1.585461
N  -1.177823 1.404349 0.453925
N  -1.167671 -1.412129 0.453635
N  0.399695 1.844613 -1.278094
N  0.414131 -1.842885 -1.276918
C  1.332397 0.822598 0.795245
C  1.338391 -0.812741 0.796153
C  -0.15524 0.794026 1.300171
C  -0.149713 -0.79461 1.300388
C  2.313417 1.492598 1.773307
C  2.323974 -1.474069 1.775501
C  1.552452 1.453997 -0.586842
C  1.563771 -1.44418 -0.585027
C  -2.586213 1.294695 0.913298
C  -2.577093 -1.312482 0.912339
C  -3.271045 -0.011126 0.441986
C  -0.952914 1.872364 -0.83047
C  -0.938666 -1.879237 -0.830374
H  -0.24931 1.202405 2.323715
H  -0.241521 -1.203493 2.323923
H  3.350612 1.355245 1.426635
H  2.114957 2.579255 1.817514
H  2.216265 1.089294 2.79531
H  3.360224 -1.32907 1.429089
H  2.223283 -1.070279 2.796963
H  2.133951 -2.562178 1.820906
H  -3.139924 2.161707 0.51555
H  -2.57768 1.361297 2.018691
H  -2.568728 -1.380127 2.017679
H  -3.124464 -2.183007 0.51347
H  -4.314006 -0.01501 0.816337
H  -3.324651 -0.010833 -0.661081
H  0.537657 2.246418 -2.211586
H  0.555496 -2.244425 -2.210016
