program: Gaussian 09
title: 000275446
version: EM64L-G09RevD.01
frameworkgroup: C1[X(C20H16N4O6S)]
method: RPBEPBE
basis: SDD
operation: Freq
keyword: #p
keyword: freq=noraman
keyword: PBEPBE/SDD
title: #p freq=noraman PBEPBE/SDD
converged: YES YES NO NO
title: Mulliken charges:
elementType: S O O O O O O N N N N C C C C C C C C C C C C C C C C C C C C H H H H H H H H H H H H H H H H
charge: 0.903182 -0.546808 -0.513195 -0.183187 -0.204290 -0.194753 -0.193520 -0.514714 -0.107399 0.016619 0.023296 -0.033742 0.185700 0.184476 -0.243454 -0.237399 0.452941 -0.346236 -0.375729 -0.278725 -0.290454 0.321620 -0.220346 0.261955 -0.227910 -0.797277 -0.309783 -0.328576 -0.505307 0.429695 -0.403614 0.320074 0.280980 0.278163 0.246078 0.245661 0.252247 0.245781 0.238417 0.237637 0.234435 0.230731 0.244081 0.252067 0.334766 0.333826 0.301987
chargesum: 0.00000
title: Mulliken charges with hydrogens summed into heavy atoms:
elementType: S O O O O O O N N N N C C C C C C C C C C C C C C C C C C C C
charge: 0.903182 -0.546808 -0.513195 -0.183187 -0.204290 -0.194753 -0.193520 -0.194640 -0.107399 0.016619 0.023296 -0.033742 0.185700 0.184476 0.037526 0.040764 0.452941 -0.100158 -0.130068 -0.026477 -0.044673 0.321620 0.018072 0.261955 0.009727 -0.088030 -0.057716 0.006189 -0.171481 0.429695 -0.101628
polarizability: 5.64970189e+02 -4.29969462e+01 4.48627151e+02 -3.24165292e+00 4.04299864e+00 1.50162421e+02
1716.lowfreq: -36.2349 -6.4583 -5.8918 -1.7337 -0.0012 -0.0012 -0.0008 4.9015 10.7974
frequency: -36.1998 -4.4630 10.6335 23.4012 31.6455 34.8885 39.9936 43.6015 45.3836 55.9302 70.7861 90.7540 109.9063 123.7879 135.6815 144.5058 158.6107 175.5265 177.6549 203.2517 212.5485 228.5734 266.0683 288.7985 291.0939 301.0342 314.3724 338.3172 348.9840 377.8921 379.3530 386.3454 406.2985 411.3066 427.9303 441.4597 471.9890 492.3153 506.8704 514.4673 526.0258 544.4450 548.9826 577.1091 590.3486 612.6176 621.1592 649.0327 653.8267 678.5688 708.2816 713.5396 733.9608 754.0300 757.6889 766.7480 775.0466 777.0178 796.9352 827.5677 829.1586 847.1679 858.1868 873.8985 882.7661 892.5347 917.5474 926.7081 955.9395 962.0263 963.2122 977.8921 983.5576 989.5022 990.6225 994.8211 1029.9679 1032.0582 1048.1741 1049.7579 1052.9467 1098.7711 1107.2267 1120.0774 1140.0619 1162.6656 1185.4866 1185.7273 1194.7043 1207.0821 1218.4307 1219.1946 1236.3810 1256.0352 1269.9552 1297.2298 1313.6997 1344.9776 1354.5004 1379.0182 1381.1314 1390.0721 1392.3837 1400.2018 1405.9021 1420.6790 1449.6991 1453.9595 1470.0516 1472.8710 1473.2688 1474.2743 1539.9955 1570.6274 1576.4305 1594.9501 1595.2424 1600.5016 1607.1721 2982.0543 3064.2151 3069.1067 3094.2085 3134.2805 3136.5182 3138.2259 3139.6704 3147.2032 3162.0211 3163.1745 3166.9917 3177.4551 3188.0981 3192.1399 3228.4273
redmass: 1.0140 6.7420 7.5890 6.2796 5.0825 8.7553 6.4719 7.3592 10.2663 9.7909 6.6177 5.3626 5.3764 5.4593 6.1988 6.8129 5.9147 9.2182 8.1405 9.0420 6.0702 7.8566 4.4604 5.0091 5.1100 6.8815 5.6563 6.5627 6.5984 8.6187 3.6822 7.1942 3.0231 4.6652 6.6386 3.7903 3.9050 7.7768 4.1355 3.9582 5.2065 3.9935 4.9748 6.0962 6.0971 6.7005 6.9613 7.0561 7.3647 9.7740 3.2818 5.3873 5.2100 3.5298 10.1755 1.4868 5.1009 5.6911 10.6208 1.3916 4.5829 1.2468 4.9871 1.5189 6.5102 1.4664 5.5783 1.7854 1.3995 1.4418 1.3080 1.5420 1.4281 1.7850 1.3872 2.9363 1.3777 1.9581 2.1776 1.6003 2.4507 2.3341 3.5978 1.2841 1.6438 1.4084 1.4889 1.3305 5.1055 6.8936 2.4825 2.7784 2.2436 1.6399 1.6883 1.2636 1.5706 2.6187 5.2852 5.6488 5.4601 3.1611 3.0658 1.2410 3.3936 6.4621 2.4229 2.4873 1.0840 2.4265 2.6952 1.0936 5.3800 6.9312 7.1568 6.3319 6.5364 6.1833 7.1687 1.0388 1.0952 1.0884 1.0999 1.0866 1.0939 1.0892 1.0892 1.0900 1.0950 1.0957 1.0966 1.0996 1.0941 1.0923 1.0710
irintensity: 0.5060 0.4247 0.8541 0.5300 0.5163 1.1527 0.7560 6.2722 0.9192 0.8403 0.7895 4.9208 3.9794 2.5124 1.9374 7.1545 3.4827 7.6651 2.5072 15.5840 4.7240 17.8394 10.0821 10.1024 0.8072 2.4624 0.7276 0.9940 0.2325 16.9662 2.6737 12.0270 4.8045 39.3991 130.0585 7.4483 17.0988 8.7080 38.2729 32.0260 3.3592 6.3759 3.4632 4.0204 53.1103 3.8267 0.4385 4.3433 12.8265 24.5543 0.7019 8.4735 4.0558 13.0938 17.0612 64.1104 23.3270 2.4525 66.9519 34.7969 24.4457 0.2565 5.7577 1.1610 12.0875 15.0348 72.3255 23.8845 13.1873 24.9430 1.5478 131.4253 28.0420 5.0444 2.1924 1.9976 3.7897 8.8506 23.9264 21.4687 36.7131 10.4550 13.0495 7.6557 106.2073 25.7373 42.9661 89.6525 209.2456 572.1331 2.1711 6.6272 12.6984 0.4104 4.6364 2.8227 2.1201 88.2451 69.5220 68.7087 0.7124 8.1660 9.4509 16.3777 74.4857 10.8524 42.6269 2.4638 15.1677 20.8108 24.3159 13.9092 85.2971 4.5014 85.2490 7.0331 2.6021 0.6788 41.7146 25.4096 18.7033 14.5729 14.2780 0.6964 23.7199 11.2559 8.8558 1.7561 19.8325 3.1189 12.2498 26.1165 5.4081 22.9503 66.7324
temp: 298.150 k
press: 1.00000 atm
elementType: 16 8 8 8 8 8 8 7 7 7 7 6 6 6 6 6 6 6 6 6 6 6 6 6 6 6 6 6 6 6 6 1 1 1 1 1 1 1 1 1 1 1 1 1 1 1 1
symmnumber: 1
zpe: 864288.6 jmol-1
zpe.correction: 0.329190 hartree
zpe.thermalcorrener: 0.356480 hartree
zpe.thermalcorrenthalpy: 0.357424 hartree
zpe.thermalcorrgfe: 0.267387 hartree
zpe.sumelectzpe: -1837.602221 hartree
zpe.sumelectthermal: -1837.574932 hartree
zpe.sumelectthermalent: -1837.573988 hartree
zpe.sumelectthermalfe: -1837.664025 hartree
dipole: -9.3719 2.5413 -2.2752
dipole: 9.9734
quadrupole: -184.9844 -179.7579 -196.5060
quadrupole: 19.3563 13.9151 11.7651
quadrupole: 2.0984 7.3248 -9.4232 19.3563 13.9151 11.7651
hfenergy: -1837.9314115 hartree
pointgroup: C01 [X(C20H16N4O6S1)]
dipole: 3.6090239 0.0333283 -1.5395788 debye
polarizability: 568.8436405|-8.2825623|425.0746419|-65.044081|-50.2057642|169.8414778 unknown
InChI: InChI=1S/C20H16N4O6S/c1-14-6-10-17(11-7-14)31(29,30)22-19-5-3-2-4-18(19)21-13-15-8-9-16(23(25)26)12-20(15)24(27)28/h2-13,22H,1H3
charge 0 multiplicity 1
47 atoms
S  2.141815 0.853455 0.374709
O  0.702425 1.578193 0.679871
O  3.091356 0.278565 1.565108
O  -5.838217 -3.262817 0.999054
O  -3.801703 -3.942616 0.244446
O  -5.430496 2.98843 0.937848
O  -7.036296 1.36744 1.034801
N  1.729202 -0.657518 -0.901884
N  -0.480699 -1.875523 0.115329
N  -4.619036 -3.026225 0.654192
N  -5.8090 1.754652 0.942782
C  3.1591 2.027241 -0.676903
C  1.869921 -1.937995 -0.320711
C  0.697229 -2.647503 0.142459
C  2.484735 3.00685 -1.423078
C  4.555623 1.891293 -0.657978
C  4.682246 3.791855 -2.227456
C  3.265027 3.891383 -2.198161
C  5.311842 2.789918 -1.442411
C  3.145386 -2.552245 -0.231571
C  0.829466 -3.993099 0.582588
C  -2.749741 -1.282321 0.618022
C  3.259113 -3.869242 0.250057
C  -4.137802 -1.618226 0.713286
C  2.100326 -4.594567 0.639428
C  5.502768 4.732912 -3.089316
C  -1.643154 -2.261497 0.585457
C  -2.415751 0.106931 0.637538
C  -5.142414 -0.637291 0.829489
C  -4.75655 0.712246 0.832863
C  -3.39992 1.101315 0.735993
H  0.701591 -0.469778 -0.998128
H  1.394567 3.09115 -1.376859
H  5.033135 1.131677 -0.030891
H  2.765982 4.670634 -2.78542
H  6.404868 2.712689 -1.440118
H  4.024219 -1.994671 -0.568138
H  -0.053633 -4.565846 0.886969
H  4.243573 -4.344832 0.309158
H  2.197609 -5.627997 0.988428
H  5.092693 5.757988 -3.073192
H  6.553452 4.778345 -2.756344
H  5.503515 4.398331 -4.144633
H  -1.836007 -3.263358 0.995706
H  -1.35676 0.387304 0.604705
H  -6.194448 -0.922506 0.903628
H  -3.137657 2.162081 0.755683
