program: Gaussian 09
title: 000275185
version: EM64L-G09RevD.01
frameworkgroup: C1[X(C19H20N2)]
method: RPBEPBE
basis: SDD
operation: Freq
keyword: #pfreq=noraman
keyword: PBEPBE/SDD
title: #p freq=noraman PBEPBE/SDD
converged: YES YES NO NO
title: Mulliken charges:
elementType: N N C C C C C C C C C C C C C C C C C C C H H H H H H H H H H H H H H H H H H H H
charge: -0.504975 -0.037594 -0.414849 -0.535126 -0.413814 0.302880 -0.536182 0.295213 0.188411 -0.429145 0.017871 0.228526 0.151724 -0.561989 0.214653 -0.510126 -0.417151 -0.371697 -0.702739 -0.257729 -0.220671 0.212562 0.206621 0.225919 0.222960 0.213144 0.207216 0.224196 0.224026 0.216425 0.249986 0.304696 0.196340 0.239103 0.235354 0.228209 0.247941 0.207530 0.213773 0.219216 0.219295
chargesum: 0.00000
title: Mulliken charges with hydrogens summed into heavy atoms:
elementType: N N C C C C C C C C C C C C C C C C C C C
charge: -0.200279 -0.037594 0.004333 -0.086247 0.006546 0.302880 -0.087961 0.295213 0.188411 -0.212721 0.017871 0.228526 0.151724 -0.312003 0.214653 -0.074684 -0.181797 -0.143488 -0.033495 -0.038512 -0.001376
polarizability: 3.99946532e+02 -1.41752572e+01 2.22474103e+02 -4.25724529e+00 -5.88053995e+00 1.14900113e+02
1716.lowfreq: -5.9849 -0.0005 0.0001 0.0006 3.2495 7.1506 29.5381 39.5876 63.1649
frequency: 29.4753 39.5782 63.1393 72.7317 92.9759 107.3133 126.3576 181.3880 194.8869 212.7019 231.8997 250.1899 269.7449 284.8740 300.6970 341.3337 383.1249 415.0354 424.0541 432.7941 456.0570 462.1532 484.8952 537.3893 548.6080 562.0797 576.5098 586.2335 613.7504 651.0715 684.0084 710.6364 739.0483 747.7534 757.8970 759.9459 770.5757 799.4612 819.9697 847.6194 849.3212 864.3565 877.2508 900.6596 909.5033 930.6273 937.5356 940.7643 958.7062 969.2009 985.8117 1009.6610 1038.0900 1064.2138 1083.7227 1091.0611 1092.6481 1122.9138 1133.1868 1152.0968 1161.8005 1167.5376 1176.0323 1224.5278 1232.1813 1239.9839 1247.4144 1260.6033 1267.2203 1286.7168 1295.1429 1312.7064 1318.0610 1326.4857 1335.8934 1343.4211 1345.7974 1355.9252 1368.0997 1377.7836 1415.1460 1424.9207 1448.7573 1456.3344 1459.0374 1464.1416 1470.4529 1471.3260 1475.5892 1476.0133 1484.9096 1489.4488 1539.0193 1571.5027 1584.5262 1588.0081 1627.7718 2958.3175 2963.1650 2977.2337 2981.0556 2982.5713 2983.5042 3020.6641 3023.3608 3044.4051 3051.8405 3057.1791 3074.5199 3094.0771 3098.8689 3112.9716 3121.8830 3129.7045 3143.5424 3161.2203 3612.3858
redmass: 3.6335 4.2390 3.1123 3.6146 2.9828 3.2966 3.5727 3.2773 1.3845 3.8374 3.3522 4.0450 3.5339 2.0537 1.9965 2.9648 4.3377 3.1955 2.9429 3.7284 3.2871 3.8170 1.1736 4.0325 4.0766 4.0356 3.8890 3.7472 4.3273 3.4357 4.7550 3.9216 4.5964 1.4626 3.6612 1.9462 3.2555 2.2218 1.5657 3.0255 1.5167 1.9844 2.2884 3.1925 1.5072 1.3830 2.3726 1.5256 2.4181 1.3016 2.4058 2.0881 2.4198 1.9862 1.8851 2.0921 1.7227 1.5749 1.1639 2.4354 1.4430 1.1696 3.3280 1.9140 1.7433 1.6404 1.2928 1.4907 1.5136 1.3563 1.7434 4.8860 1.4209 2.6736 1.5712 1.4316 1.8165 1.5968 2.7994 1.2197 4.3456 2.4608 1.1613 1.2514 1.4942 1.5626 1.1834 1.0753 1.5877 1.3972 2.8093 1.2365 5.5022 7.4134 6.4428 6.3215 7.1244 1.0644 1.0635 1.0370 1.0660 1.0608 1.0626 1.0942 1.0957 1.0984 1.1042 1.0967 1.0985 1.1012 1.0907 1.0908 1.0848 1.0889 1.0952 1.1001 1.0798
irintensity: 0.2026 0.2012 0.1073 0.0507 0.2559 1.7851 0.3100 0.4091 0.1411 0.1683 0.9574 0.8252 2.3663 1.3843 0.8632 0.8602 1.3298 5.1236 3.0428 1.9810 2.4190 7.8058 92.2271 7.0754 0.3684 0.7849 3.1370 1.7514 0.4965 3.6066 4.0923 6.1562 4.7825 89.3241 0.9031 1.8665 13.5108 10.2565 7.9222 4.1856 0.1997 6.4358 6.1084 2.6213 7.1488 2.2322 0.7760 14.7418 7.1598 0.0605 1.0150 8.3596 0.1643 16.6837 1.6002 4.3344 0.2363 5.4573 1.8028 5.3566 1.1766 3.6326 6.3010 5.2404 18.2969 2.9409 15.9189 24.1163 0.7699 3.8273 23.1660 13.0490 0.2066 19.4421 6.1563 5.1874 34.2648 10.2847 38.6884 18.4090 32.2335 20.8057 6.1872 14.0648 5.2579 10.3271 25.5254 9.0689 38.8048 3.9618 1.1845 21.6707 16.7379 3.8062 27.6930 227.1930 2.4076 31.9487 17.0782 48.1968 47.5436 27.3351 45.6064 52.6195 10.3880 82.1085 61.5441 5.3640 49.3832 29.3712 43.6720 12.3869 1.1827 2.3572 35.6724 47.0155 33.8793
temp: 298.150 k
press: 1.00000 atm
elementType: 7 7 6 6 6 6 6 6 6 6 6 6 6 6 6 6 6 6 6 6 6 1 1 1 1 1 1 1 1 1 1 1 1 1 1 1 1 1 1 1 1
symmnumber: 1
zpe: 898180.2 jmol-1
zpe.correction: 0.342099 hartree
zpe.thermalcorrener: 0.359977 hartree
zpe.thermalcorrenthalpy: 0.360921 hartree
zpe.thermalcorrgfe: 0.295810 hartree
zpe.sumelectzpe: -844.064136 hartree
zpe.sumelectthermal: -844.046258 hartree
zpe.sumelectthermalent: -844.045314 hartree
zpe.sumelectthermalfe: -844.110425 hartree
dipole: -3.9837 -2.5955 0.1891
dipole: 4.7584
quadrupole: -108.9016 -114.2997 -129.2408
quadrupole: 0.8692 -0.2747 -3.2245
quadrupole: 8.5791 3.1810 -11.7601 0.8692 -0.2747 -3.2245
hfenergy: -844.4062343 hartree
pointgroup: C01 [X(C19H20N2)]
dipole: -1.5391512 -1.0631225 0.0744285 debye
polarizability: 400.584123|-9.357395|221.8348602|-4.0590642|-6.0184121|114.9017653 unknown
InChI: InChI=1S/C19H20N2/c1-2-15-16-9-5-6-10-17(16)21-19(15)18-11-13-7-3-4-8-14(13)12-20-18/h5-6,9-12,21H,2-4,7-8H2,1H3
charge 0 multiplicity 1
41 atoms
N  1.384262 -1.232566 0.187599
N  -1.161865 1.472637 0.074482
C  -5.316023 -1.663306 0.208634
C  -3.868148 -1.957536 -0.246555
C  -5.80825 -0.321783 -0.380299
C  -2.939844 -0.756858 -0.099312
C  -4.946065 0.844954 0.153243
C  -3.453272 0.562582 0.049344
C  0.797177 0.035639 -0.054057
C  -1.537984 -0.924609 -0.153433
C  -0.661278 0.191544 -0.044753
C  1.824488 0.965276 -0.313478
C  3.07663 0.23947 -0.21517
C  -2.51082 1.621195 0.108325
C  2.772398 -1.130754 0.108434
C  1.70052 2.436027 -0.627444
C  4.436232 0.622903 -0.373889
C  3.777103 -2.106669 0.290431
C  1.750177 3.323437 0.646203
C  5.442763 -0.345311 -0.198559
C  5.116468 -1.695651 0.132528
H  -5.978766 -2.492178 -0.102869
H  -5.359475 -1.611391 1.315075
H  -3.881129 -2.258797 -1.315026
H  -3.454441 -2.820451 0.310062
H  -6.870351 -0.151561 -0.122611
H  -5.74409 -0.362149 -1.486164
H  -5.205778 1.02282 1.21811
H  -5.187384 1.784064 -0.381298
H  -1.133918 -1.931467 -0.316704
H  -2.866216 2.657159 0.193214
H  0.875629 -2.054274 0.504262
H  2.521119 2.730269 -1.311672
H  0.744656 2.629114 -1.143239
H  4.69663 1.657395 -0.624747
H  3.53315 -3.145648 0.539554
H  0.879348 3.09874 1.285615
H  1.717711 4.395882 0.377008
H  2.671792 3.139894 1.228406
H  6.495572 -0.064906 -0.315121
H  5.923273 -2.425635 0.264072
