program: Gaussian 09
title: 000275184
version: EM64L-G09RevD.01
frameworkgroup: C1[X(C15H14N2O2)]
method: RPBEPBE
basis: SDD
operation: Freq
keyword: #p
keyword: freq=noraman
keyword: PBEPBE/SDD
title: #p freq=noraman PBEPBE/SDD
converged: YES YES NO NO
title: Mulliken charges:
elementType: O O N N C C C C C C C C C C C C C C C H H H H H H H H H H H H H H
charge: -0.437108 -0.230090 -0.413491 -0.059827 -0.015648 0.367901 -0.572481 0.071091 0.280032 0.246199 -0.412980 -0.373404 -0.256035 -0.202450 -0.356543 0.156817 -0.170286 -0.342628 -0.783895 0.243129 0.243513 0.313176 0.243163 0.235566 0.353552 0.225831 0.224800 0.240349 0.237013 0.238163 0.241132 0.244760 0.220680
chargesum: 0.00000
title: Mulliken charges with hydrogens summed into heavy atoms:
elementType: O O N N C C C C C C C C C C C C C C C
charge: -0.083557 -0.230090 -0.100316 -0.059827 -0.015648 0.367901 -0.085839 0.071091 0.280032 0.246199 -0.169817 -0.137838 -0.030204 0.022350 -0.116194 0.156817 0.066727 -0.104464 -0.077323
polarizability: 1.58039091e+02 -7.77511903e+00 1.80873539e+02 5.15477110e+00 -5.57728717e+00 1.74974857e+02
1716.lowfreq: -8.2098 0.0002 0.0005 0.0007 4.3242 8.8622 20.1010 34.9381 59.2528
frequency: 20.0745 34.8929 59.2517 83.9231 89.5062 122.2370 160.9779 188.8793 205.3683 224.9508 241.1701 266.9006 307.8442 313.1917 362.9616 376.4801 392.8820 432.4544 470.7543 480.8462 526.6753 539.4887 556.3184 564.5797 591.1761 608.3572 626.8340 649.8991 698.4828 719.8249 736.6303 745.4575 759.7426 762.2421 779.2126 819.6823 862.1730 868.8922 902.5061 924.2093 935.8149 961.7926 972.6285 977.3795 991.6068 1000.2503 1019.7934 1030.0394 1048.1155 1066.3801 1089.9547 1116.2825 1166.9789 1172.4521 1173.8259 1189.5887 1215.8612 1234.3352 1247.4431 1255.1812 1287.2256 1307.1092 1330.5046 1339.6245 1355.5426 1390.0406 1401.4162 1419.8066 1441.9451 1444.9496 1456.5292 1461.9984 1475.7769 1481.2117 1574.1960 1583.7815 1613.1248 1637.0446 1668.7822 2963.9832 2987.7924 3047.3275 3072.8879 3100.0835 3128.5609 3132.0751 3138.8808 3147.5877 3149.8362 3164.5764 3166.8452 3488.2397 3583.1428
redmass: 4.1671 5.2101 4.8186 1.0779 4.4112 5.3820 5.6704 3.1360 5.3187 4.5075 2.9866 4.2853 3.7413 6.1428 3.3735 1.1593 3.2884 3.4632 4.5013 6.0860 3.6211 4.9580 3.4314 2.3855 1.9837 4.5707 3.8533 6.4163 5.9040 4.0439 4.4557 2.3449 1.8265 2.4476 1.6213 2.6768 1.4608 4.3830 1.3580 2.6500 1.4839 5.8299 2.8756 1.5474 1.4208 2.3990 2.0550 2.0683 1.6024 3.6040 1.6541 2.0108 1.4165 1.2135 1.2828 1.4448 1.3555 1.7007 2.0344 2.3960 3.7355 5.7709 2.5916 1.9783 1.8507 1.4940 2.0832 3.1995 1.1093 2.2125 1.0497 2.8588 1.1998 3.2742 7.0916 5.2614 6.7244 7.3287 9.7461 1.0655 1.0366 1.0938 1.0974 1.1000 1.0854 1.0870 1.0897 1.0930 1.0953 1.1004 1.1003 1.0655 1.0795
irintensity: 0.7341 0.1895 1.0394 0.5641 0.8367 0.8739 1.4463 1.3035 8.2433 11.6265 5.4628 1.4631 0.9404 5.2353 4.0296 114.5048 6.2851 0.2279 7.5931 1.6347 6.3839 0.5030 7.6922 24.6266 89.8331 4.7698 21.4541 18.4823 10.6818 2.3980 5.0290 15.1481 68.5553 64.4677 41.8042 7.9273 1.5003 1.5312 1.2009 3.2227 19.8038 8.0927 57.4232 18.7783 0.2125 7.6072 3.9581 0.0925 9.9839 6.0610 15.3937 27.2998 58.6863 13.1528 48.0876 23.1852 3.6576 4.5326 17.5609 10.2911 12.7342 5.3706 6.7397 25.1907 21.3121 13.7560 11.4504 1.5174 18.0965 48.8375 17.9289 42.5404 35.0275 64.4285 49.7100 41.6408 4.7742 121.2277 328.8094 12.0241 16.0056 6.1688 13.2363 21.9191 2.0621 2.5752 6.7207 17.5894 25.7508 20.4840 22.6182 14.0970 36.4766
temp: 298.150 k
press: 1.00000 atm
elementType: 8 8 7 7 6 6 6 6 6 6 6 6 6 6 6 6 6 6 6 1 1 1 1 1 1 1 1 1 1 1 1 1 1
symmnumber: 1
zpe: 675208.6 jmol-1
zpe.correction: 0.257173 hartree
zpe.thermalcorrener: 0.273638 hartree
zpe.thermalcorrenthalpy: 0.274582 hartree
zpe.thermalcorrgfe: 0.212179 hartree
zpe.sumelectzpe: -838.622252 hartree
zpe.sumelectthermal: -838.605788 hartree
zpe.sumelectthermalent: -838.604844 hartree
zpe.sumelectthermalfe: -838.667247 hartree
dipole: -2.1882 -3.3002 -0.6314
dipole: 4.0098
quadrupole: -105.0095 -109.2023 -100.8085
quadrupole: -2.8097 7.6950 -9.2641
quadrupole: -0.0027 -4.1955 4.1983 -2.8097 7.6950 -9.2641
hfenergy: -838.8794258 hartree
pointgroup: C01 [X(C15H14N2O2)]
dipole: 0.6027115 -1.4222858 -0.3202727 debye
polarizability: 157.8426935|6.6189012|171.1468505|3.2802066|4.5882257|184.8979433 unknown
InChI: InChI=1S/C15H14N2O2/c1-10-5-4-6-11(16-10)9-15(19)12-7-2-3-8-13(12)17-14(15)18/h2-8,17,19H,9H2,1H3
charge 0 multiplicity 1
33 atoms
O  -1.884186 2.070806 1.570729
O  0.333376 3.246188 -0.10816
N  -0.717985 1.616972 -1.48406
N  1.606375 -0.038409 0.077477
C  -0.854104 1.262472 0.866918
C  -1.546158 0.149664 0.104406
C  0.216469 0.849042 1.900565
C  -0.287002 2.163791 -0.278557
C  -1.43651 0.410611 -1.288298
C  1.286289 -0.105193 1.403322
C  -2.227899 -0.986332 0.555551
C  -1.991824 -0.448867 -2.250766
C  -2.80057 -1.86836 -0.399956
C  -2.67989 -1.598408 -1.783046
C  1.944912 -0.990454 2.292885
C  2.595095 -0.847999 -0.415757
C  2.968935 -1.820466 1.79067
C  3.30149 -1.750583 0.41881
C  2.884079 -0.726788 -1.896379
H  -0.308788 0.417287 2.772285
H  0.70516 1.784646 2.247512
H  -0.490488 2.025295 -2.389887
H  -2.32775 -1.188185 1.627402
H  -1.907522 -0.245829 -3.323833
H  -1.483711 2.96821 1.735727
H  -3.341233 -2.759978 -0.065644
H  -3.126815 -2.286468 -2.509586
H  1.658492 -1.022926 3.3493
H  3.497306 -2.513285 2.454486
H  4.088915 -2.383197 -0.002554
H  1.979266 -0.972208 -2.482067
H  3.160881 0.312533 -2.148928
H  3.700795 -1.398283 -2.209565
