program: Gaussian 09
title: 000275283
version: EM64L-G09RevD.01
frameworkgroup: C1[X(C21H20O9)]
method: RPBEPBE
basis: SDD
operation: Freq
keyword: #pfreq=noraman
keyword: PBEPBE/SDD
title: #p freq=noraman PBEPBE/SDD
converged: YES YES NO NO
title: Mulliken charges:
elementType: O O O O O O O O O C C C C C C C C C C C C C C C C C C C C C H H H H H H H H H H H H H H H H H H H H
charge: -0.261707 -0.257578 -0.292643 -0.307708 -0.304411 -0.446976 -0.235282 -0.410471 -0.244169 0.173305 0.311657 0.431376 0.122859 -0.522154 0.180355 -0.387982 0.159707 -0.569737 -0.584023 -0.332344 -0.622167 0.265345 0.289273 0.016484 -0.203990 0.078178 0.210627 -0.525572 -0.527315 -0.525463 0.324346 0.263524 0.273570 0.272675 0.254794 0.281058 0.284455 0.241334 0.240002 0.259346 0.226832 0.221567 0.249069 0.228259 0.229283 0.257830 0.227635 0.230691 0.379882 0.376376
chargesum: 0.00000
title: Mulliken charges with hydrogens summed into heavy atoms:
elementType: O O O O O O O O O C C C C C C C C C C C C C C C C C C C C C
charge: -0.261707 -0.257578 -0.292643 -0.307708 -0.304411 -0.067094 -0.235282 -0.034096 -0.244169 0.173305 0.311657 0.431376 0.122859 -0.197809 0.180355 -0.124458 0.159707 -0.296167 -0.311348 -0.077551 -0.056654 0.265345 0.289273 0.016484 0.277346 0.078178 0.210627 0.182172 0.179295 0.190694
polarizability: 3.66377187e+02 -1.46547221e+01 3.11386240e+02 1.02516561e+01 -3.58983832e+00 1.90204125e+02
1716.lowfreq: -3.0651 0.0005 0.0006 0.0006 1.4333 4.1156 18.6850 27.4102 30.6865
frequency: 18.6460 27.3718 30.6493 32.7015 38.3676 49.3088 52.8334 58.0436 68.3000 74.0843 76.7589 82.6120 93.8487 103.0555 129.8688 143.8777 153.1100 159.5482 162.4989 168.6494 193.6753 203.5916 214.4768 222.4605 243.5086 255.8934 261.7900 285.1873 319.0154 326.7595 341.3433 354.6537 363.7688 398.4056 420.7595 423.7041 436.3223 475.6099 494.9828 511.8867 529.3334 540.9953 560.0902 581.8041 587.0531 599.2178 608.1694 626.8348 638.7639 648.0945 667.9842 677.2065 686.1981 713.9555 726.8951 758.5085 771.2832 774.6137 790.1631 804.5073 825.2393 838.3393 866.6709 868.2696 879.8979 896.4158 905.6548 922.2128 937.5892 942.4831 944.7683 950.5429 977.1017 1017.3484 1029.2709 1034.8385 1061.8959 1064.5967 1066.6513 1110.3220 1111.9554 1114.4332 1119.4248 1120.0963 1135.8985 1150.5921 1154.6568 1156.0707 1158.3752 1188.3883 1214.4403 1215.9435 1227.9825 1253.7590 1270.1150 1275.5080 1295.1798 1322.1233 1350.4038 1352.6734 1361.9330 1373.3705 1394.0620 1416.7175 1426.1027 1432.8416 1434.7945 1445.9342 1454.7594 1458.2099 1459.5023 1463.7337 1474.8808 1477.6501 1483.4810 1485.6394 1487.8428 1557.4602 1571.4347 1599.1820 1602.6225 1616.2425 1632.5059 1658.4311 2974.0438 2976.1782 2979.5834 3014.9947 3016.2889 3071.7503 3076.4462 3080.5426 3081.6869 3097.2446 3121.3477 3123.0697 3124.6887 3155.4479 3158.1102 3160.0865 3165.2230 3184.8723 3511.4206 3529.9123
redmass: 5.4654 5.1102 5.4712 2.5025 7.7462 6.6146 9.5179 6.2359 4.0978 4.2616 4.4427 3.3902 2.8921 4.9180 5.7128 2.8259 1.6880 2.0703 1.2385 1.3556 5.1593 3.8432 5.1705 6.0823 5.5942 5.9070 6.6861 5.3013 7.1271 4.3013 6.4421 4.1692 5.2877 4.4234 4.0589 5.1006 3.8023 5.9058 2.1914 5.5133 5.7511 5.1656 4.6718 5.2166 2.2679 2.7223 3.3235 3.4162 3.6851 1.8886 4.4120 6.9114 6.2861 5.4804 5.6517 4.4410 4.3527 7.2904 5.0278 5.6024 1.5657 9.1580 5.5630 6.2298 4.1019 1.6169 1.5082 1.3946 5.7310 3.1138 1.5482 4.6066 5.7946 3.3910 3.2945 5.4200 2.4443 3.6124 1.4610 1.2508 1.2757 1.2515 1.7299 1.2319 1.6982 1.3561 1.6775 1.5311 1.4457 2.3297 1.4249 1.3690 1.9990 1.9615 2.9720 1.5057 2.7885 5.8407 2.0003 7.1596 1.5565 3.0549 2.7410 1.3134 1.1137 1.3150 1.3717 3.7570 1.4105 1.0693 1.1060 1.5660 2.3956 1.0713 1.0539 1.0561 1.2551 7.5336 9.4370 7.3786 7.3860 8.0430 8.6625 8.1906 1.0304 1.0323 1.0298 1.0544 1.0605 1.1044 1.0984 1.1045 1.1014 1.1179 1.1028 1.1034 1.1041 1.0898 1.0943 1.0918 1.0926 1.0963 1.0639 1.0642
irintensity: 0.4148 0.8741 1.8584 11.7157 1.8825 0.2012 0.7421 2.8096 1.2108 0.1007 4.3091 3.9119 6.2789 1.8274 0.9276 1.0303 1.2032 1.6256 0.2813 0.2779 4.1101 2.4976 0.9210 3.9936 7.4831 9.6438 2.3583 14.3771 1.8606 3.7994 1.8537 0.7591 2.5952 16.4800 1.7010 0.2854 11.6752 13.8364 9.4968 13.7484 32.6517 33.3943 14.4303 6.0734 74.7784 42.0152 38.7393 26.9784 32.6548 49.7255 19.2336 2.7607 2.7479 3.5399 4.9041 20.9259 9.9035 18.5289 12.9537 7.1780 31.0786 25.5909 5.0818 3.2990 12.7543 20.1794 22.1020 54.5946 71.4881 148.6855 18.2904 12.2670 102.0481 257.7992 394.5795 241.2798 194.7333 68.7171 4.3780 14.5340 10.4757 2.5654 3.9807 2.2149 95.0256 1.1482 31.6940 13.0392 15.1244 20.2287 10.9411 29.4002 164.9277 59.8976 55.1507 28.6887 144.7254 267.7610 72.9371 46.2230 7.9276 26.7874 54.5473 3.1627 31.8675 30.4302 19.3904 108.0049 46.8422 16.2004 1.4164 16.4705 149.0205 1.3347 15.5412 33.2144 27.8433 94.1211 213.8818 9.7676 2.9587 50.1062 146.3764 180.0335 59.5904 95.5474 68.5455 138.4087 9.1554 25.1755 1.6419 20.5676 29.1774 28.7287 24.5712 24.9579 19.4198 4.7005 9.8731 2.0159 0.1512 5.4319 30.1370 53.1723
temp: 298.150 k
press: 1.00000 atm
elementType: 8 8 8 8 8 8 8 8 8 6 6 6 6 6 6 6 6 6 6 6 6 6 6 6 6 6 6 6 6 6 1 1 1 1 1 1 1 1 1 1 1 1 1 1 1 1 1 1 1 1
symmnumber: 1
zpe: 977731.9 jmol-1
zpe.correction: 0.372398 hartree
zpe.thermalcorrener: 0.402358 hartree
zpe.thermalcorrenthalpy: 0.403302 hartree
zpe.thermalcorrgfe: 0.308035 hartree
zpe.sumelectzpe: -1486.979870 hartree
zpe.sumelectthermal: -1486.949911 hartree
zpe.sumelectthermalent: -1486.948966 hartree
zpe.sumelectthermalfe: -1487.044234 hartree
dipole: -0.0867 -1.6509 -0.5522
dipole: 1.7430
quadrupole: -138.9131 -156.5653 -176.1927
quadrupole: -0.0576 -3.1014 -1.7014
quadrupole: 18.3106 0.6584 -18.9690 -0.0576 -3.1014 -1.7014
hfenergy: -1487.3522688 hartree
pointgroup: C01 [X(C21H20O9)]
dipole: -0.0539293 -0.6835372 -0.0110576 debye
polarizability: 365.0593365|-1.0804114|294.6010085|28.894012|38.1752737|208.3072072 unknown
InChI: InChI=1S/C21H20O9/c1-26-16-7-12(8-17(27-2)20(16)28-3)19(13(21(24)25)9-18(22)23)11-4-5-14-15(6-11)30-10-29-14/h4-8,22,24H,9-10H2,1-3H3
charge 0 multiplicity 1
50 atoms
O  -4.849247 -0.866892 -1.576562
O  -4.626353 -3.087887 -0.686035
O  4.046016 0.015121 2.313593
O  2.955269 -1.871088 -2.133602
O  4.879181 -1.462851 -0.013985
O  -0.151287 4.198719 1.33385
O  1.355914 3.021092 0.026833
O  -3.783233 4.085773 1.142061
O  -2.778864 3.391539 -0.828109
C  -0.462783 0.634078 0.424412
C  -1.547117 -0.360351 0.17566
C  0.932589 0.118618 0.286504
C  -0.741222 1.943653 0.796167
C  -2.690842 0.001805 -0.610052
C  -3.648432 -0.984547 -0.831229
C  -1.420635 -1.68828 0.674259
C  -3.521528 -2.292138 -0.311879
C  1.311319 -0.630127 -0.856757
C  1.885102 0.341825 1.311245
C  -2.41343 -2.674967 0.449484
C  -2.092854 2.384482 1.338031
C  3.193802 -0.169851 1.209457
C  2.624213 -1.119529 -0.980071
C  3.573424 -0.929115 0.06479
C  -5.472772 -2.215078 -1.550333
C  0.277138 3.020205 0.668504
C  -2.868966 3.31292 0.417415
C  5.351478 0.657424 2.038044
C  3.987226 -1.245322 -2.994781
C  4.933785 -2.946811 0.006565
H  -2.778273 0.998273 -1.053487
H  -0.532753 -1.95127 1.257128
H  0.607387 -0.810875 -1.674151
H  1.620488 0.90331 2.212153
H  -2.315964 -3.688911 0.844308
H  -2.734431 1.507257 1.538862
H  -1.956736 2.914378 2.296149
H  -6.478152 -2.139367 -1.104077
H  -5.483698 -2.630651 -2.57325
H  5.939671 0.058397 1.323262
H  5.857066 0.705563 3.014558
H  5.193508 1.679565 1.643934
H  4.927787 -1.093094 -2.435281
H  4.141732 -1.950849 -3.825322
H  3.618728 -0.277678 -3.384039
H  4.350261 -3.36623 -0.831825
H  5.999645 -3.20114 -0.096904
H  4.545737 -3.323456 0.970715
H  0.523471 4.90797 1.159056
H  -4.298063 4.657291 0.509436
