program: Gaussian 09
title: 000275159
version: EM64L-G09RevD.01
frameworkgroup: C1[X(C18H20O2)]
method: RPBEPBE
basis: SDD
operation: Freq
keyword: #pfreq=noraman
keyword: PBEPBE/SDD
title: #p freq=noraman PBEPBE/SDD
converged: YES YES NO NO
title: Mulliken charges:
elementType: O O C C C C C C C C C C C C C C C C C C H H H H H H H H H H H H H H H H H H H H
charge: -0.444310 -0.247366 -0.330572 0.397935 0.270972 0.233173 0.012723 -0.526648 0.321868 0.452766 -0.545539 -0.406835 0.437103 -0.420864 -0.848689 -0.413216 -0.358095 -0.788588 -0.817815 -0.815694 0.233119 0.253670 0.250038 0.229487 0.230169 0.267432 0.231512 0.216781 0.235187 0.235763 0.249108 0.210600 0.249810 0.237348 0.227239 0.221520 0.363467 0.230584 0.231588 0.233271
chargesum: 0.00000
title: Mulliken charges with hydrogens summed into heavy atoms:
elementType: O O C C C C C C C C C C C C C C C C C C
charge: -0.080844 -0.247366 -0.097453 0.397935 0.270972 0.233173 0.012723 -0.272978 0.321868 0.452766 -0.295501 -0.177348 0.437103 -0.190694 -0.132965 -0.178029 -0.122332 -0.079070 -0.131708 -0.120252
polarizability: 2.22674317e+02 -1.21229702e+01 2.13114865e+02 7.94367502e+00 -7.55218781e+00 1.70175910e+02
1716.lowfreq: -23.8328 -8.4558 -4.0298 -0.0006 -0.0006 0.0005 7.2794 12.6257 21.7673
frequency: -22.8227 11.1741 21.5405 28.0344 31.1049 83.9532 112.7110 120.0109 127.3520 145.4213 161.9974 181.7303 193.9245 208.0352 258.1668 283.2643 300.8111 312.8975 321.1842 358.3411 364.8665 391.9692 417.6009 445.7371 449.1852 456.6609 464.7486 466.7005 484.3876 519.1800 552.5223 621.1436 666.9177 680.4131 711.0317 734.1975 741.0804 748.0051 779.7055 815.6025 822.5384 836.0594 883.2893 899.8176 904.9169 928.1125 954.6809 958.2061 972.5563 993.9963 998.3603 1011.4933 1013.1125 1023.3625 1041.0009 1046.0477 1049.5249 1051.4386 1103.8569 1155.0576 1163.5865 1189.3404 1211.4174 1223.6089 1226.4103 1247.0420 1266.8446 1277.5946 1291.3071 1304.3654 1366.6113 1369.9595 1384.0656 1394.7429 1396.8099 1400.1153 1401.4401 1405.6046 1410.7049 1451.7933 1459.4951 1469.8300 1471.2773 1472.5163 1475.5321 1478.5640 1485.2268 1493.6136 1498.2906 1548.9775 1574.8816 1584.1337 1623.4803 1624.1319 2967.3809 2974.7146 2978.1730 2989.0709 3033.3767 3047.5705 3055.5403 3057.2994 3073.9805 3082.8485 3084.6954 3085.9242 3088.3345 3112.6115 3112.7895 3117.5400 3137.8395 3141.5755 3147.6314 3387.6554
redmass: 1.2760 2.1653 3.8866 1.6617 1.7513 6.7887 3.5816 3.0817 4.0721 3.9093 3.8676 1.0709 3.7994 1.0608 4.1595 3.0206 2.9922 3.1878 3.5247 4.4366 3.6386 5.3040 2.7384 2.6081 3.6325 2.4980 2.2544 3.0723 2.8700 3.4289 3.9656 4.5497 5.5912 5.9984 3.9253 3.4139 3.6017 4.0777 5.1276 2.8907 1.2876 1.6104 3.1903 1.7445 1.4482 2.4217 2.5826 1.4458 1.3513 1.9678 1.9496 1.3954 1.3780 3.1983 1.5971 1.5835 1.5538 1.5564 2.6048 1.5015 1.4126 2.2172 1.7656 1.7598 1.5909 3.4188 3.6258 1.6943 1.4754 1.3782 2.6833 4.9260 1.6098 2.8739 1.2406 1.2719 1.2389 1.2531 2.5862 1.0478 1.1293 1.0828 1.0495 1.0536 1.0627 1.1247 1.1090 2.8663 3.0827 6.2369 6.1419 5.8506 6.1087 6.3901 1.0406 1.0382 1.0376 1.0365 1.0830 1.0933 1.0957 1.0973 1.0955 1.0997 1.0992 1.0990 1.1013 1.0877 1.0903 1.0874 1.0968 1.0954 1.0918 1.0638
irintensity: 0.4090 0.4388 0.2943 0.5581 0.2853 1.8614 0.7543 0.3863 1.5891 2.8003 3.9740 0.7954 2.5885 0.5619 2.9480 2.7596 0.6694 0.2664 0.2157 2.3625 42.5430 11.4018 10.9708 16.8616 5.7392 6.6292 53.8543 2.4398 31.9893 46.3784 2.6627 10.0290 1.9050 4.8337 1.3271 2.2547 2.1652 6.9844 10.1465 13.4698 31.2707 20.6669 31.2900 4.5607 12.0787 3.1770 84.7348 7.5188 0.6395 8.7105 8.6797 3.4389 3.6359 21.7881 6.0459 1.9984 30.9953 11.9202 13.5612 1.4801 10.2294 19.5438 11.0446 30.5509 19.9571 11.3260 155.7525 19.8841 10.2288 8.0743 78.2922 4.5720 30.7570 0.1166 15.4274 4.1552 8.2101 27.8956 5.1799 11.8873 5.7671 4.2719 10.1710 7.8127 17.7876 19.5091 28.5491 28.7224 29.2801 145.4947 19.1419 2.0579 3.3245 3.8280 32.6551 34.7626 30.3122 20.3445 32.7300 21.8894 19.7749 17.6358 9.2264 17.2990 22.3656 15.0816 32.3126 6.4007 17.5317 9.9919 32.5496 33.7020 3.8425 56.4914
temp: 298.150 k
press: 1.00000 atm
elementType: 8 8 6 6 6 6 6 6 6 6 6 6 6 6 6 6 6 6 6 6 1 1 1 1 1 1 1 1 1 1 1 1 1 1 1 1 1 1 1 1
symmnumber: 1
zpe: 859759.8 jmol-1
zpe.correction: 0.327465 hartree
zpe.thermalcorrener: 0.347144 hartree
zpe.thermalcorrenthalpy: 0.348089 hartree
zpe.thermalcorrgfe: 0.276807 hartree
zpe.sumelectzpe: -846.920334 hartree
zpe.sumelectthermal: -846.900655 hartree
zpe.sumelectthermalent: -846.899711 hartree
zpe.sumelectthermalfe: -846.970992 hartree
dipole: 1.8199 3.6554 2.0808
dipole: 4.5830
quadrupole: -108.6332 -116.3171 -119.4127
quadrupole: -1.6523 -1.9024 -7.2676
quadrupole: 6.1544 -1.5294 -4.6250 -1.6523 -1.9024 -7.2676
hfenergy: -847.2477993 hartree
pointgroup: C01 [X(C18H20O2)]
dipole: -0.8322139 -1.5926101 0.1488791 debye
polarizability: 219.8907163|-7.6245393|199.9107116|-13.0633971|23.0775204|186.1636635 unknown
InChI: InChI=1S/C18H20O2/c1-11-5-7-13(3)15(9-11)17(19)18(20)16-10-12(2)6-8-14(16)4/h5-10,17,19H,1-4H3
charge 0 multiplicity 1
40 atoms
O  1.289049 2.745122 -1.227107
O  -0.581514 2.687812 0.607328
C  0.626053 1.4491 -1.062177
C  1.622916 0.387066 -0.579636
C  2.344943 -0.395208 -1.529939
C  -1.660075 0.604944 -0.034581
C  -0.578954 1.623981 -0.095116
C  1.881454 0.234891 0.803575
C  -2.866789 0.831482 0.712812
C  2.833685 -0.692382 1.291424
C  -1.498427 -0.616035 -0.755895
C  3.291625 -1.327117 -1.038899
C  -2.480864 -1.625984 -0.766805
C  3.530943 -1.481701 0.344444
C  2.144846 -0.230578 -3.028536
C  -3.851497 -0.189002 0.685821
C  -3.671334 -1.388862 -0.030295
C  -3.145942 2.087537 1.514058
C  3.114096 -0.816278 2.779274
C  -2.282253 -2.91975 -1.535671
H  0.240739 1.179845 -2.061629
H  1.333386 0.857526 1.522451
H  -0.565055 -0.794723 -1.299346
H  3.85599 -1.937867 -1.75426
H  4.269912 -2.215391 0.689318
H  2.289465 0.820191 -3.338819
H  2.865188 -0.852214 -3.58705
H  1.129416 -0.530619 -3.356351
H  -4.780956 -0.032601 1.245628
H  -4.460128 -2.151529 -0.017126
H  -3.052082 2.997523 0.895853
H  -4.161629 2.047636 1.944822
H  -2.414726 2.217743 2.331012
H  3.827262 -0.038557 3.115448
H  2.193623 -0.694408 3.37776
H  3.555577 -1.797312 3.027683
H  1.016717 3.290921 -0.432229
H  -1.266437 -2.98614 -1.961089
H  -2.432407 -3.801026 -0.885053
H  -3.003119 -3.005433 -2.370901
