program: Gaussian 09
title: 000275139
version: EM64L-G09RevD.01
frameworkgroup: C1[X(C15H10O4)]
method: RPBEPBE
basis: SDD
operation: Freq
keyword: #pfreq=noraman
keyword: PBEPBE/SDD
title: #p freq=noraman PBEPBE/SDD
converged: YES YES NO NO
title: Mulliken charges:
elementType: O O O O C C C C C C C C C C C C C C C H H H H H H H H H H
charge: -0.260322 -0.249787 -0.211414 -0.213297 0.201559 0.171113 0.377580 -0.429096 -0.326848 -0.365264 -0.204384 -0.015498 0.322136 0.008269 -0.323856 -0.354722 -0.236437 -0.227621 -0.223360 0.288608 0.259293 0.281691 0.242744 0.245733 0.263846 0.275778 0.233876 0.234963 0.234716
chargesum: 0.00000
title: Mulliken charges with hydrogens summed into heavy atoms:
elementType: O O O O C C C C C C C C C C C C C C C
charge: -0.260322 -0.249787 -0.211414 -0.213297 0.201559 0.171113 0.377580 -0.140488 -0.067554 -0.083573 0.284093 -0.015498 0.322136 0.008269 -0.060010 -0.078945 -0.002561 0.007342 0.011356
polarizability: 2.90499340e+02 4.60722171e+00 1.61179907e+02 -5.93292383e+00 -1.24743560e+01 1.04875030e+02
1716.lowfreq: -10.3118 -0.0009 -0.0008 0.0002 1.2917 6.2955 21.7479 30.2671 37.4824
frequency: 21.6812 30.2256 37.4278 52.1491 109.0684 118.3626 145.4912 157.2582 215.0425 236.4668 270.8864 296.3641 339.1656 369.4422 398.7257 413.7410 418.0058 432.4850 464.4471 564.5495 569.3017 611.9578 646.9441 664.9143 680.7634 691.0334 706.8237 720.6411 749.9358 781.0808 789.0314 819.4247 838.2329 843.9284 859.0141 883.9028 900.1951 951.1199 971.8704 975.0601 988.8369 993.3884 1009.6308 1015.3889 1033.7113 1065.3767 1066.5504 1087.7131 1122.7821 1139.9026 1174.5033 1187.7954 1200.3642 1245.2312 1268.4466 1305.7397 1321.4702 1362.4635 1382.8123 1388.8916 1434.8020 1449.5873 1472.3001 1477.5242 1485.6465 1533.6206 1543.0282 1586.7168 1596.7380 1608.4006 1621.8473 3017.8700 3108.5528 3130.7569 3142.7383 3154.5039 3160.2168 3165.6921 3179.4051 3185.7980 3198.7841
redmass: 6.8948 5.0625 4.3104 2.4608 9.2076 8.7033 5.4203 7.7692 6.0948 6.8619 7.4812 8.5096 10.7727 7.8955 2.8441 3.1501 5.2371 6.3918 4.3950 7.1479 5.4260 6.4402 7.2040 6.8241 8.6596 2.0848 5.4005 3.5274 2.9276 6.4826 3.9660 2.5787 4.7922 2.0844 1.2483 1.7236 4.0140 1.4459 1.4257 5.0205 4.6820 1.4949 1.3657 3.2082 2.1726 1.4696 3.8731 1.5979 1.0447 1.3026 1.0743 1.3602 1.7525 4.2032 1.3857 5.3946 1.3641 1.4032 4.2319 8.6322 2.3137 4.5162 2.1022 2.2180 1.4222 10.4037 10.5705 6.2980 7.9460 6.0178 8.3415 1.0562 1.1160 1.0856 1.0889 1.0938 1.0894 1.0983 1.0973 1.0964 1.0934
irintensity: 3.0054 0.4642 0.9937 11.2607 4.6355 2.4369 0.1110 1.6423 0.1096 1.2120 24.9636 2.3501 0.7985 2.5458 0.0451 3.8378 17.1932 4.4727 7.6987 16.4818 4.1325 0.2403 92.8856 11.0725 3.5607 37.0721 20.2628 29.9538 32.0468 16.2635 47.6586 47.9329 41.5288 17.7464 1.6112 20.7970 59.9390 1.9054 10.2389 135.9139 1.0470 1.0649 0.4128 17.9304 4.7934 6.3136 51.6626 9.8102 1.5855 8.6458 11.5935 141.9057 35.6075 499.9973 25.1684 104.4080 5.0541 12.2857 8.3129 6.8497 21.8018 52.7554 154.3815 0.1769 70.9498 179.7579 282.7886 11.4088 9.7088 20.6115 33.8978 120.2157 26.2110 0.3159 8.7384 12.3079 0.2680 29.6671 9.7261 4.6109 4.7469
temp: 298.150 k
press: 1.00000 atm
elementType: 8 8 8 8 6 6 6 6 6 6 6 6 6 6 6 6 6 6 6 1 1 1 1 1 1 1 1 1 1
symmnumber: 1
zpe: 552445.6 jmol-1
zpe.correction: 0.210415 hartree
zpe.thermalcorrener: 0.225957 hartree
zpe.thermalcorrenthalpy: 0.226901 hartree
zpe.thermalcorrgfe: 0.164859 hartree
zpe.sumelectzpe: -877.140914 hartree
zpe.sumelectthermal: -877.125372 hartree
zpe.sumelectthermalent: -877.124428 hartree
zpe.sumelectthermalfe: -877.186470 hartree
dipole: -1.1279 -1.0870 -2.9845
dipole: 3.3706
quadrupole: -77.2781 -108.2765 -111.9470
quadrupole: -0.4823 -5.5839 -2.0245
quadrupole: 21.8891 -9.1093 -12.7798 -0.4823 -5.5839 -2.0245
hfenergy: -877.3513291 hartree
pointgroup: C01 [X(C15H10O4)]
dipole: 0.4712352 -1.1070943 0.55752 debye
polarizability: 288.7469127|0.6403959|123.7294672|-17.4951115|29.4660226|144.0778976 unknown
InChI: InChI=1S/C15H10O4/c16-14(10-4-2-1-3-5-10)15(17)11-6-7-12-13(8-11)19-9-18-12/h1-8H,9H2
charge 0 multiplicity 1
29 atoms
O  3.551658 -1.827043 -1.195825
O  5.084319 -0.549706 0.139454
O  -0.761691 2.033188 0.949768
O  -1.124905 0.198328 -1.887235
C  2.874806 -0.77033 -0.535415
C  3.784213 -0.025273 0.251308
C  1.074151 0.650681 0.186025
C  1.519887 -0.464906 -0.596726
C  3.371794 1.066573 1.026168
C  1.997946 1.392419 0.979171
C  4.988092 -1.645489 -0.872959
C  -0.353742 1.061442 0.23776
C  -2.685863 -0.106424 -0.061828
C  -1.390751 0.338678 -0.65335
C  -2.962604 -0.028163 1.331665
C  -3.658757 -0.66671 -0.937756
C  -4.190449 -0.50674 1.834796
C  -4.8840 -1.138233 -0.431876
C  -5.152473 -1.060108 0.957558
H  0.835515 -1.033502 -1.228239
H  4.081573 1.634126 1.632401
H  1.608449 2.235315 1.558531
H  5.532108 -1.332888 -1.781933
H  5.381311 -2.573384 -0.428529
H  -2.231231 0.41763 2.011048
H  -3.425445 -0.718827 -2.006616
H  -4.401139 -0.443184 2.907653
H  -5.629924 -1.565392 -1.110739
H  -6.106147 -1.428079 1.352622
