program: Gaussian 09
title: 000275146
version: EM64L-G09RevD.01
frameworkgroup: C1[X(C16H16O2)]
method: RPBEPBE
basis: SDD
operation: Freq
keyword: #pfreq=noraman
keyword: PBEPBE/SDD
title: #p freq=noraman PBEPBE/SDD
converged: YES YES NO NO
title: Mulliken charges:
elementType: O O C C C C C C C C C C C C C C C C H H H H H H H H H H H H H H H H
charge: -0.443598 -0.241622 -0.286163 0.331330 0.020321 0.295082 0.204061 0.325665 -0.352508 -0.409654 -0.335224 -0.840015 -0.259237 -0.411038 -0.234543 -0.786689 -0.271380 -0.218866 0.219842 0.246364 0.232409 0.250569 0.217529 0.278255 0.229173 0.227784 0.237865 0.227181 0.211176 0.250829 0.250741 0.236573 0.363144 0.234645
chargesum: 0.00000
title: Mulliken charges with hydrogens summed into heavy atoms:
elementType: O O C C C C C C C C C C C C C C C C
charge: -0.080454 -0.241622 -0.066321 0.331330 0.020321 0.295082 0.204061 0.325665 -0.106144 -0.177245 -0.084655 -0.115058 -0.031453 -0.173174 -0.007362 -0.073943 -0.034807 0.015780
polarizability: 2.13605730e+02 -6.32907121e+00 1.69896728e+02 -1.27173048e+01 7.35367311e+00 1.44606246e+02
1716.lowfreq: -12.2537 -4.6136 -0.0006 -0.0002 0.0002 5.8194 19.6473 24.7431 37.1964
frequency: 18.6762 24.6934 37.1614 95.0473 116.3094 141.8202 149.3516 160.6970 201.8660 204.8850 214.0686 230.8088 284.1498 347.1681 359.1738 386.4041 406.1550 420.2965 445.9203 457.7838 470.1743 490.1573 505.1244 550.8578 556.1080 601.5304 651.5406 672.0772 722.6714 732.0327 754.6275 767.8366 771.8243 792.2667 839.6053 847.8924 873.2558 877.5818 940.9100 947.8077 960.0720 987.9516 988.9199 995.3097 999.2160 1014.9536 1042.6584 1047.3519 1050.3227 1054.7623 1100.3669 1138.9765 1173.9002 1179.0285 1182.3410 1206.5360 1217.8314 1230.8640 1255.2831 1273.8007 1288.7800 1306.8396 1368.9029 1374.8768 1383.2334 1397.4764 1405.8905 1426.4622 1434.2168 1452.7733 1467.1570 1469.3805 1478.2478 1481.5761 1486.0857 1547.8671 1580.8642 1587.9444 1611.0214 1613.1572 2969.7887 2990.3102 3021.7162 3052.9071 3075.2011 3089.3014 3090.3272 3118.2989 3124.1465 3126.7317 3139.7309 3141.2368 3153.3770 3160.6770 3170.1515 3400.2185
redmass: 3.8667 4.1113 5.1827 7.2609 4.2010 2.9150 1.3785 2.7424 3.6198 2.6288 1.5801 2.0691 4.6772 3.9522 4.2693 4.7849 3.5191 2.5544 3.0237 2.1467 1.7620 3.5202 3.7958 5.0798 5.3708 4.9458 5.6808 5.7492 2.5886 2.2442 1.4448 4.1286 1.7817 4.4407 3.3017 4.6338 1.3229 1.3906 4.3154 1.5119 1.4028 1.6134 1.3353 1.5711 1.3505 4.9465 1.5990 1.7366 1.9735 2.2546 2.1737 1.6827 1.3876 1.3397 1.1068 1.7739 1.9567 2.4560 3.0015 1.4822 1.4481 1.3844 2.5343 4.3315 1.8023 1.2671 1.3046 1.7990 2.0553 1.0464 1.2239 1.0905 1.8955 1.9880 1.4725 6.6260 6.7720 6.3680 5.9086 6.1296 1.0405 1.0366 1.0830 1.0928 1.0955 1.0999 1.1015 1.0856 1.0892 1.0864 1.0936 1.0894 1.0939 1.1007 1.1000 1.0639
irintensity: 0.3112 0.3845 0.3075 2.4778 0.4315 0.0210 0.1390 2.1787 1.3204 1.7158 3.9479 2.3249 1.2460 39.5928 7.9047 4.9529 2.9905 23.2210 4.7283 15.1001 84.3731 34.7409 0.9515 0.5578 3.3102 30.3019 5.6896 11.6850 14.1199 30.1282 55.4493 9.8163 40.9873 6.6025 7.2322 9.4877 0.2908 0.6752 117.9066 7.7998 2.1605 0.5918 0.1030 2.8239 0.1897 20.1061 8.3489 16.4032 6.2121 4.0196 8.6155 3.3502 5.4660 8.2878 2.2647 6.4007 6.6113 2.2749 219.5066 18.0061 1.0983 4.4345 70.2627 2.8103 30.3687 18.5942 23.7840 1.1219 3.0172 12.4626 25.9534 13.6700 40.6583 9.1750 17.7571 111.3783 24.2957 6.8780 28.5386 4.0598 26.0413 17.5905 34.2248 20.0391 8.2442 21.8921 28.6437 9.1185 3.7609 5.5438 30.2525 10.4571 24.9150 28.3521 17.1797 55.2112
temp: 298.150 k
press: 1.00000 atm
elementType: 8 8 6 6 6 6 6 6 6 6 6 6 6 6 6 6 6 6 1 1 1 1 1 1 1 1 1 1 1 1 1 1 1 1
symmnumber: 1
zpe: 718690.3 jmol-1
zpe.correction: 0.273735 hartree
zpe.thermalcorrener: 0.290394 hartree
zpe.thermalcorrenthalpy: 0.291338 hartree
zpe.thermalcorrgfe: 0.228023 hartree
zpe.sumelectzpe: -768.461086 hartree
zpe.sumelectthermal: -768.444427 hartree
zpe.sumelectthermalent: -768.443483 hartree
zpe.sumelectthermalfe: -768.506798 hartree
dipole: -1.7171 -3.6735 -0.0574
dipole: 4.0554
quadrupole: -93.7865 -109.1616 -102.7524
quadrupole: -2.4293 -1.2628 3.4613
quadrupole: 8.1136 -7.2614 -0.8522 -2.4293 -1.2628 3.4613
hfenergy: -768.734821 hartree
pointgroup: C01 [X(C16H16O2)]
dipole: -0.7659681 1.3906367 0.1583661 debye
polarizability: 210.8924847|6.3476656|168.218843|17.2335639|11.5538923|148.9973763 unknown
InChI: InChI=1S/C16H16O2/c1-11-7-3-5-9-13(11)15(17)16(18)14-10-6-4-8-12(14)2/h3-10,15,17H,1-2H3
charge 0 multiplicity 1
34 atoms
O  1.361356 -2.512808 0.606088
O  -0.787924 -2.265496 -0.878779
C  0.752754 -1.178028 0.611155
C  1.715907 -0.141302 0.016786
C  -0.610029 -1.249285 -0.131256
C  2.795902 0.337986 0.819923
C  -1.634379 -0.187267 0.057579
C  -2.954249 -0.300383 -0.506051
C  1.597268 0.284622 -1.328955
C  3.710846 1.254115 0.244579
C  -1.299427 0.964017 0.831296
C  2.992407 -0.141934 2.248443
C  2.520332 1.194603 -1.888296
C  -3.873014 0.751785 -0.259102
C  3.57955 1.686387 -1.094763
C  -3.416524 -1.479085 -1.339733
C  -2.228354 1.994577 1.055571
C  -3.527092 1.885283 0.506986
H  0.565151 -0.947909 1.675937
H  0.781945 -0.101223 -1.952176
H  4.543901 1.625188 0.853795
H  -0.289885 1.06523 1.240389
H  2.185917 0.21008 2.922047
H  2.997075 -1.245417 2.293953
H  3.947495 0.227657 2.658678
H  2.414756 1.513427 -2.931043
H  -4.882105 0.674104 -0.680008
H  4.302835 2.394227 -1.515162
H  -4.47733 -1.357038 -1.619302
H  -2.812713 -1.58875 -2.25741
H  -3.293645 -2.434185 -0.799553
H  -1.946254 2.872415 1.645807
H  0.957348 -2.991227 -0.175262
H  -4.26522 2.677835 0.67384
