program: Gaussian 09
title: 000275174
version: EM64L-G09RevD.01
frameworkgroup: C1[X(C22H28)]
method: RPBEPBE
basis: SDD
operation: Freq
keyword: #p
keyword: freq=noraman
keyword: PBEPBE/SDD
title: #p freq=noraman PBEPBE/SDD
converged: YES YES NO NO
title: Mulliken charges:
elementType: C C C C C C C C C C C C C C C C C C C C C C H H H H H H H H H H H H H H H H H H H H H H H H H H H H
charge: 0.249463 0.177397 0.249232 0.177515 -0.805656 -0.715133 0.125099 0.072050 0.125221 0.072344 0.171106 0.174212 0.170929 0.174074 -0.885969 -0.854338 -0.886088 -0.854423 -0.883016 -0.886573 -0.883047 -0.886514 0.257593 0.226012 0.218837 0.200698 0.234935 0.252102 0.239206 0.234437 0.223000 0.231900 0.234756 0.239156 0.252249 0.231924 0.223152 0.234491 0.232585 0.252370 0.231548 0.231731 0.232360 0.253314 0.231573 0.252348 0.232494 0.253297 0.232310 0.231736
chargesum: 0.00000
title: Mulliken charges with hydrogens summed into heavy atoms:
elementType: C C C C C C C C C C C C C C C C C C C C C C
charge: 0.249463 0.177397 0.249232 0.177515 -0.322051 -0.295598 0.125099 0.072050 0.125221 0.072344 0.171106 0.174212 0.170929 0.174074 -0.159725 -0.165002 -0.159926 -0.164856 -0.166512 -0.169168 -0.166632 -0.169171
polarizability: 3.05318965e+02 -2.90191457e-02 2.65459360e+02 -3.45257406e-03 -3.84517915e-01 1.52520217e+02
1716.lowfreq: -15.6671 -9.5249 -0.0005 -0.0003 0.0005 5.4318 26.6235 28.4702 34.3997
frequency: 26.3856 28.2560 33.6186 44.7158 62.4186 63.1697 72.3371 137.4700 142.7848 158.3477 164.3165 168.4140 170.0517 173.2675 182.9858 216.5394 239.7553 244.6692 262.0734 280.7477 323.0564 341.8544 346.8637 357.5566 358.0136 363.9298 367.8294 379.3488 399.7598 403.5451 454.6267 469.0169 475.1080 477.8503 549.5544 556.8732 562.3314 567.0153 577.4598 586.7024 596.4410 624.7316 655.9521 674.1703 743.4514 766.3286 782.3609 816.0553 823.2057 880.9772 902.8552 951.2742 978.6067 981.2146 990.1740 1005.2999 1007.2649 1023.0756 1025.6054 1038.5407 1038.9368 1041.6847 1044.1172 1051.6801 1051.8671 1060.3454 1066.6054 1070.7776 1077.6810 1079.2675 1088.6692 1097.9303 1178.4733 1196.0242 1239.5094 1252.7138 1273.2781 1305.6144 1320.0969 1323.1648 1354.2890 1366.3256 1389.6083 1389.9468 1392.7237 1393.1862 1395.3547 1397.3194 1402.5621 1403.1182 1413.6231 1423.6279 1429.3542 1434.1976 1446.4659 1456.8033 1462.6919 1464.2742 1464.8364 1466.9468 1470.5838 1472.5869 1475.2292 1483.9833 1490.5071 1495.5501 1496.2844 1497.2226 1506.0333 1506.1977 1509.0953 1510.4193 1587.6146 1590.3889 1590.4619 1599.7156 2906.2090 2919.9541 2970.0639 2970.3689 2973.1878 2973.3033 2974.4858 2974.7346 2976.0556 2976.4900 3039.8416 3040.1980 3041.1540 3041.1816 3041.9042 3041.9902 3043.8443 3044.1984 3094.7236 3098.9982 3103.1770 3104.5771 3105.0793 3109.4799 3109.7269 3114.1004 3114.6454 3116.9336
redmass: 1.8480 2.6295 1.6757 1.9752 1.8792 1.7401 1.9896 1.2613 1.3849 1.7757 1.5770 1.6464 1.2095 1.1787 1.2890 1.3239 1.8531 2.3401 3.9662 2.3037 2.5305 2.8500 3.7918 3.2295 2.8220 2.8726 2.9659 3.3471 2.6619 2.6875 4.8225 4.8710 4.3766 4.5339 2.6267 3.4014 3.6117 3.0778 3.9626 3.5815 4.3652 3.7874 4.9720 3.4757 2.7882 3.5163 2.8728 3.1743 2.2652 3.3819 1.8930 1.9205 1.4937 1.4965 1.6582 1.3572 1.3719 1.4513 1.4864 1.6883 1.5561 2.8244 1.8564 1.7293 1.7459 2.1651 2.5448 2.4207 3.1187 2.0014 1.9560 2.6150 1.1415 1.2530 2.4994 6.3867 1.8519 1.9682 9.6680 7.3142 6.5753 3.8220 1.2681 1.2710 1.2527 1.2148 1.2751 1.2182 1.2013 1.1643 3.1433 4.2488 4.5620 3.4237 1.0926 1.0868 1.0761 1.1126 1.0882 1.0919 1.1331 1.1218 1.0548 1.0635 1.0599 1.1280 1.1000 1.1479 1.0872 1.1013 1.0478 1.0476 5.9371 6.1621 6.5776 7.8561 1.0716 1.0724 1.0420 1.0419 1.0417 1.0416 1.0416 1.0415 1.0413 1.0414 1.0957 1.0956 1.0966 1.0966 1.0972 1.0973 1.0977 1.0976 1.0871 1.0930 1.0942 1.0931 1.0931 1.0932 1.0932 1.0915 1.0924 1.0851
irintensity: 0.0771 0.3047 0.1383 0.0296 0.0445 0.0141 0.0119 0.0384 1.6534 2.0125 1.0797 0.3066 0.2312 0.3774 7.5738 0.1812 3.9890 2.8481 0.0007 0.1239 0.1461 2.8819 0.4071 0.0798 1.4476 0.0231 0.0097 0.1858 0.0437 0.0779 0.7335 0.1966 0.0007 0.0319 0.1011 0.2521 0.3571 1.4136 0.0134 0.0778 0.0084 0.0586 0.2746 0.9336 0.5717 0.0030 3.8299 3.7302 10.0846 0.8815 1.8571 0.4251 0.0042 0.2211 0.6502 4.0376 14.4044 0.0076 0.4254 3.3398 0.0768 11.1610 3.6384 0.0851 0.1663 19.3297 2.3900 26.3165 3.4991 2.6037 13.5845 0.0241 22.7843 0.5373 0.0052 0.4223 16.2970 0.0003 0.8029 0.2234 0.1256 3.3194 0.5769 0.1722 10.6657 2.8599 0.5117 47.2408 5.0826 9.8939 14.0007 2.3983 11.0616 1.0289 8.6589 13.7432 9.9705 2.0041 0.4646 30.0663 0.3619 30.7997 2.9389 0.7715 11.6100 28.1772 14.6831 31.4145 20.9501 11.9902 0.9277 0.0453 0.0025 0.1736 0.7808 1.5881 43.1146 11.2843 17.6142 49.0545 24.9949 55.1594 70.4491 24.7412 18.5680 54.1526 34.1324 29.3529 18.8287 36.9043 4.4804 9.4511 6.0000 27.9751 20.3113 7.2379 31.2377 64.0337 13.7154 40.7159 22.1191 27.9794 0.5013 13.8074
temp: 298.150 k
press: 1.00000 atm
elementType: 6 6 6 6 6 6 6 6 6 6 6 6 6 6 6 6 6 6 6 6 6 6 1 1 1 1 1 1 1 1 1 1 1 1 1 1 1 1 1 1 1 1 1 1 1 1 1 1 1 1
symmnumber: 1
zpe: 1133858.7 jmol-1
zpe.correction: 0.431864 hartree
zpe.thermalcorrener: 0.455636 hartree
zpe.thermalcorrenthalpy: 0.456580 hartree
zpe.thermalcorrgfe: 0.378415 hartree
zpe.sumelectzpe: -853.546183 hartree
zpe.sumelectthermal: -853.522411 hartree
zpe.sumelectthermalent: -853.521467 hartree
zpe.sumelectthermalfe: -853.599632 hartree
dipole: 0.0003 -0.1518 -0.1098
dipole: 0.1874
quadrupole: -123.5864 -122.7218 -135.0282
quadrupole: -0.0050 -0.0047 -0.0703
quadrupole: 3.5258 4.3903 -7.9161 -0.0050 -0.0047 -0.0703
hfenergy: -853.9780469 hartree
pointgroup: C01 [X(C22H28)]
dipole: 0.0001077 0.057459 0.0461734 debye
polarizability: 305.3189372|0.0412406|265.211046|0.0251416|5.3040753|152.7685581 unknown
InChI: InChI=1S/C22H28/c1-11-12(2)16(6)20-10-22-18(8)14(4)13(3)17(7)21(22)9-19(20)15(11)5/h9-10H2,1-8H3
charge 0 multiplicity 1
50 atoms
C  1.263951 0.713491 -0.59505
C  1.269445 -0.70348 -0.663778
C  -1.263808 0.713109 -0.594389
C  -1.26953 -0.703761 -0.664825
C  -0.000184 1.416445 -1.083889
C  0.000249 -1.338235 -1.235384
C  2.383637 1.426772 -0.095543
C  2.408997 -1.438988 -0.231379
C  -2.383391 1.425902 -0.094058
C  -2.409409 -1.439579 -0.234304
C  3.521836 0.698739 0.362768
C  3.534586 -0.727408 0.293302
C  -3.521894 0.697414 0.363081
C  -3.53472 -0.72863 0.291993
C  2.355632 2.950354 -0.057211
C  2.461759 -2.961306 -0.323306
C  -2.354846 2.949458 -0.054099
C  -2.462996 -2.961547 -0.33109
C  4.722678 1.455239 0.923049
C  4.762883 -1.490968 0.781902
C  -4.723268 1.453523 0.922884
C  -4.762192 -1.493205 0.781116
H  -0.000353 2.475008 -0.788692
H  -0.000603 1.408968 -2.199117
H  0.000817 -1.181926 -2.338879
H  0.000199 -2.425085 -1.087659
H  1.602973 3.324342 0.665156
H  3.32633 3.37937 0.232713
H  2.092088 3.373973 -1.0442
H  2.582713 -3.427219 0.673338
H  1.553262 -3.388826 -0.771869
H  3.312994 -3.299033 -0.944404
H  -1.594444 3.322268 0.660609
H  -2.101387 3.374112 -1.043408
H  -3.322218 3.378419 0.246572
H  -3.32053 -3.296941 -0.944582
H  -1.559242 -3.387136 -0.791004
H  -2.573484 -3.431433 0.665012
H  4.427344 2.125444 1.752246
H  5.498851 0.779943 1.311432
H  5.199881 2.08986 0.150785
H  5.675765 -1.186351 0.235273
H  4.953603 -1.30616 1.856611
H  4.656588 -2.577911 0.655682
H  -5.196591 2.092435 0.151817
H  -5.502032 0.777842 1.305322
H  -4.429709 2.119396 1.756212
H  -4.651712 -2.580564 0.662423
H  -4.956788 -1.302303 1.854016
H  -5.674533 -1.195233 0.229908
