program: Gaussian 09
title: 000275131
version: EM64L-G09RevD.01
frameworkgroup: C1[X(C14H14N8O2)]
method: RPBEPBE
basis: SDD
operation: Freq
keyword: #p
keyword: freq=noraman
keyword: PBEPBE/SDD
title: #p freq=noraman PBEPBE/SDD
converged: YES YES NO NO
title: Mulliken charges:
elementType: O O N N N N N N N N C C C C C C C C C C C C C C H H H H H H H H H H H H H H
charge: -0.246780 -0.246782 -0.413331 -0.413337 -0.003082 -0.003081 -0.273375 -0.273376 -0.041716 -0.041719 0.276518 0.276516 -0.287731 -0.287726 -0.310533 -0.310529 0.187437 0.187446 -0.322446 -0.322448 -0.329261 -0.329262 -0.127314 -0.127310 0.272557 0.272558 0.217448 0.217444 0.246830 0.246830 0.243174 0.243174 0.293905 0.293903 0.389529 0.389524 0.228172 0.228174
chargesum: 0.00000
title: Mulliken charges with hydrogens summed into heavy atoms:
elementType: O O N N N N N N N N C C C C C C C C C C C C C C
charge: -0.246780 -0.246782 -0.119426 -0.119434 -0.003082 -0.003081 0.116154 0.116148 -0.041716 -0.041719 0.276518 0.276516 -0.015173 -0.015169 -0.093086 -0.093085 0.187437 0.187446 -0.075616 -0.075618 -0.086087 -0.086088 0.100858 0.100864
polarizability: 5.79563852e+02 -1.52561236e+01 2.05373711e+02 -3.35789570e-03 4.10409765e-04 1.00602405e+02
1716.lowfreq: -10.7450 -3.2475 -1.0042 -0.0012 -0.0010 0.0008 8.0299 15.5368 18.5591
frequency: 7.9529 15.5137 18.5478 36.0863 42.0119 44.4440 56.1006 86.2799 95.1097 101.5985 117.3467 170.8406 171.3990 232.2875 234.4853 281.2019 292.1480 300.3926 319.1773 345.7177 360.7288 364.5607 364.9667 368.1650 391.5268 426.3033 426.6220 497.6797 503.0675 513.8479 536.1424 541.7265 568.0423 644.7715 659.0041 659.4089 659.7522 683.3059 683.3696 703.9375 750.5475 750.6062 804.3816 834.5193 836.8876 852.1155 858.9859 860.2911 871.6996 888.7611 888.7628 956.6646 956.6742 964.0676 964.4651 984.1159 986.9728 987.3459 1034.7364 1057.7313 1060.3523 1071.3757 1085.7197 1088.4714 1126.4642 1146.3514 1188.6907 1218.7061 1218.8862 1247.4772 1250.3734 1279.3836 1296.0710 1299.5849 1303.9002 1322.8329 1325.5183 1333.4406 1396.7081 1399.4293 1402.4364 1460.8648 1461.2871 1511.1305 1515.8156 1528.0030 1542.5457 1543.9060 1573.7400 1579.1135 1586.3038 1609.1441 1622.6983 1661.3867 3078.3413 3078.8986 3122.9433 3122.9680 3140.3712 3140.3843 3147.7640 3147.7742 3173.9481 3173.9575 3433.6985 3433.8343 3488.4685 3509.1958
redmass: 6.9859 4.5294 7.3833 6.8240 3.9887 8.1129 7.5082 7.3828 7.4913 4.8100 6.3312 8.1085 7.4154 5.9263 6.9572 3.5753 6.5819 6.5516 3.7502 7.0131 4.3570 3.4657 2.7219 3.5028 6.7998 5.5985 5.4881 4.8630 1.8597 1.7145 1.1718 1.2290 1.2370 7.2450 7.0093 6.8106 7.1560 4.4969 4.4939 6.8257 2.9836 2.9539 4.3510 1.6345 1.7405 1.4428 1.4220 6.4532 7.0001 1.2629 1.2628 2.6968 2.7147 2.1116 2.0987 3.0548 1.4402 1.5309 6.5364 2.5535 2.1122 2.5937 1.6307 1.7927 3.2888 3.7788 1.4000 1.3105 1.3091 2.4910 2.8135 2.4065 2.3029 5.5639 2.2518 1.5899 1.4929 1.5081 1.9805 1.8761 2.1633 1.9061 1.9374 1.7244 1.8322 1.9951 7.4916 7.2765 5.8591 5.5946 6.9256 8.7725 8.4745 7.5130 1.0913 1.0922 1.0873 1.0873 1.0896 1.0896 1.0972 1.0972 1.0964 1.0964 1.0763 1.0763 1.0819 1.0815
irintensity: 0.6380 1.2314 3.0224 0.2039 0.5646 3.1336 0.2277 5.2099 12.3617 2.5204 8.6104 10.0673 0.5594 4.9613 20.4288 28.1413 0.6274 4.5014 55.2200 0.0300 1.3151 0.0682 0.0750 0.4791 7.9333 1.4312 3.1667 6.9352 90.0897 229.4522 0.1274 118.5758 0.4468 132.5319 2.4277 4.4533 0.1851 39.6153 7.5932 1.0267 15.3525 2.5291 9.3425 14.2423 55.5288 44.3507 0.5478 0.8661 37.8643 1.7372 5.8834 3.8259 0.0903 0.2361 2.6673 0.0381 2.3594 1.2799 64.4656 0.0596 46.5561 0.0325 33.9926 0.0088 99.8819 0.1148 186.7536 16.7650 0.0119 0.0228 250.6033 0.0771 90.4244 0.1309 96.0417 0.4420 5.7250 0.1122 50.4256 7.6893 121.2543 0.1525 43.3810 0.0136 404.4604 0.1411 226.4616 5.8677 1060.1469 0.0374 639.0501 0.0173 287.5912 0.0552 0.0117 33.1298 24.2308 0.0467 55.7222 10.2058 25.7365 8.1863 11.1251 1.8850 53.6698 0.0241 0.0035 643.9588
temp: 298.150 k
press: 1.00000 atm
elementType: 8 8 7 7 7 7 7 7 7 7 6 6 6 6 6 6 6 6 6 6 6 6 6 6 1 1 1 1 1 1 1 1 1 1 1 1 1 1
symmnumber: 1
zpe: 736101.5 jmol-1
zpe.correction: 0.280366 hartree
zpe.thermalcorrener: 0.302427 hartree
zpe.thermalcorrenthalpy: 0.303371 hartree
zpe.thermalcorrgfe: 0.223494 hartree
zpe.sumelectzpe: -1128.538519 hartree
zpe.sumelectthermal: -1128.516458 hartree
zpe.sumelectthermalent: -1128.515514 hartree
zpe.sumelectthermalfe: -1128.595391 hartree
dipole: -0.0004 -0.0003 0.1242
dipole: 0.1242
quadrupole: -200.4127 -129.6058 -140.8138
quadrupole: 22.3316 0.0002 0.0012
quadrupole: -43.4686 27.3383 16.1303 22.3316 0.0002 0.0012
hfenergy: -1128.8188851 hartree
pointgroup: C01 [X(C14H14N8O2)]
dipole: -0.0001672 -0.0001944 0.0488592 debye
polarizability: 580.0766747|6.3712698|204.8605992|-0.0100645|0.1733417|100.6026944 unknown
InChI: InChI=1S/C14H14N8O2/c23-13(11-1-5-15-6-2-11)21-19-9-17-18-10-20-22-14(24)12-3-7-16-8-4-12/h1-10,17-18,21-22H
charge 0 multiplicity 1
38 atoms
O  4.4536 -1.624459 -0.126138
O  -4.453475 1.624916 -0.120537
N  3.6889 0.586542 0.039769
N  -3.688951 -0.586682 0.037969
N  8.819033 1.037082 0.090445
N  -8.819167 -1.036829 0.087751
N  0.113054 0.689437 0.013185
N  -0.113107 -0.689611 0.010848
N  2.356135 0.196063 0.034667
N  -2.356166 -0.196262 0.034111
C  6.095274 0.161513 0.035796
C  -6.095303 -0.161419 0.035628
C  7.135516 -0.645903 -0.488408
C  -7.135525 0.647877 -0.485711
C  6.453614 1.409395 0.610455
C  -6.453715 -1.411175 0.606147
C  4.689842 -0.386849 -0.017445
C  -4.689822 0.386972 -0.015943
C  8.463387 -0.171422 -0.445363
C  -8.463449 0.173417 -0.444059
C  7.812462 1.798572 0.612564
C  -7.81261 -1.80019 0.607159
C  1.416667 1.124467 0.020842
C  -1.416729 -1.124645 0.017144
H  6.890354 -1.625697 -0.90848
H  -6.890305 1.629048 -0.902524
H  5.71686 2.062672 1.092402
H  -5.716973 -2.066157 1.085791
H  9.285908 -0.771252 -0.849954
H  -9.285956 0.774705 -0.846509
H  8.118658 2.752903 1.055902
H  -8.118854 -2.755966 1.047341
H  3.947156 1.581089 0.014057
H  -3.947265 -1.581124 0.008965
H  -0.743589 1.253756 0.014986
H  0.743527 -1.253944 0.010666
H  1.547338 2.216552 0.013222
H  -1.547426 -2.216695 0.005856
