program: Gaussian 09
title: 000275083
version: EM64L-G09RevD.01
frameworkgroup: C1[X(C18H16O4)]
method: RPBEPBE
basis: SDD
operation: Freq
keyword: #pfreq=noraman
keyword: PBEPBE/SDD
title: #p freq=noraman PBEPBE/SDD
converged: YES YES NO NO
title: Mulliken charges:
elementType: O O O O C C C C C C C C C C C C C C C C C C H H H H H H H H H H H H H H H H
charge: -0.287106 -0.421948 -0.202399 -0.250582 -0.633090 -0.043850 0.486903 -0.410478 -0.369178 0.167064 -0.225148 -0.229816 -0.239552 0.261340 0.475737 -0.358757 -0.246807 -0.363598 -0.380686 -0.236289 -0.233288 -0.231229 0.238764 0.240414 0.286609 0.234721 0.239561 0.225481 0.224516 0.228270 0.246223 0.257994 0.231184 0.237499 0.384594 0.230572 0.232508 0.233848
chargesum: 0.00000
title: Mulliken charges with hydrogens summed into heavy atoms:
elementType: O O O O C C C C C C C C C C C C C C C C C C
charge: -0.287106 -0.037355 -0.202399 -0.250582 -0.153913 0.242759 0.486903 -0.175757 -0.129618 0.167064 0.000333 -0.005300 -0.011282 0.261340 0.475737 -0.112534 0.011188 -0.132414 -0.143186 -0.005717 -0.000780 0.002619
polarizability: 3.14658239e+02 3.12479383e+01 1.95039755e+02 1.89502208e+01 1.53376956e+01 1.54397571e+02
1716.lowfreq: -8.7167 -3.4779 -1.2210 0.0003 0.0004 0.0007 8.9906 16.5192 20.6993
frequency: 8.5869 16.4314 20.6524 33.8285 46.8519 54.9441 62.9587 82.4794 99.6895 132.2736 162.9239 166.9662 211.1155 244.2452 274.6430 277.9304 303.1584 329.7814 380.4951 401.7765 402.1881 432.9666 483.2223 490.0795 516.7791 558.6675 564.0223 582.6784 614.8102 617.2733 622.4700 670.6476 679.3272 698.1699 702.8934 708.9845 760.1419 775.6317 798.2713 811.6674 848.5411 851.9051 863.7489 888.8014 899.6716 929.7118 930.6400 952.2442 975.0085 981.0134 988.6447 990.3036 991.5036 994.5710 998.0473 1012.5819 1025.8470 1027.1156 1041.4336 1061.0820 1084.1018 1088.5201 1116.1052 1172.5326 1174.7004 1188.8230 1191.7505 1193.9192 1217.7542 1218.9592 1236.6591 1276.6058 1300.0383 1309.1272 1321.1601 1330.4228 1337.4790 1344.6306 1383.9936 1388.1207 1440.7031 1441.5231 1466.2710 1485.0337 1485.8875 1582.0029 1594.4341 1606.8481 1615.0672 1620.3333 1646.6663 1681.7292 3011.7631 3040.2957 3076.3880 3101.8369 3115.2982 3124.5670 3125.1379 3130.3755 3137.2876 3142.3557 3148.1892 3153.2966 3163.0270 3163.7375 3168.3180 3521.7439
redmass: 4.1093 5.0318 4.9147 5.9553 6.7795 6.1592 5.2904 6.3689 7.0006 4.8294 4.5439 3.9597 6.1471 6.6909 6.2886 3.0038 7.7740 3.1361 2.7994 2.8066 2.7537 4.8906 3.3540 2.8855 4.6000 5.5535 2.1890 2.3647 6.0342 6.0345 3.8400 4.8271 4.1084 1.6867 1.9870 4.4263 1.8694 1.9472 4.4031 4.2300 1.2797 1.2548 3.3069 1.8263 2.3070 1.4513 1.9916 4.2702 1.3982 1.3865 5.7669 5.1138 3.7229 1.3764 1.3059 1.2242 2.2072 2.2561 2.3540 3.6966 1.6030 1.6321 2.9690 1.0546 1.0673 1.1280 1.1296 1.3193 2.4369 1.6301 1.3012 1.4955 1.7222 1.7707 1.4791 1.2718 1.2974 1.5604 7.5034 6.9132 2.2877 2.1607 1.1181 2.2864 2.3132 5.6848 6.0661 6.9685 6.1503 9.2768 5.6980 9.4672 1.0604 1.0835 1.1021 1.0899 1.0872 1.0861 1.0865 1.0869 1.0917 1.0916 1.0961 1.0965 1.0919 1.1014 1.1015 1.0643
irintensity: 0.2258 0.1017 0.7515 1.5365 0.1920 1.1592 0.4160 0.0887 0.5870 0.2077 2.0931 2.2207 0.6456 2.5843 0.1965 1.0174 0.6911 4.7429 12.2880 0.2612 0.0406 24.8428 1.9093 10.8663 33.4719 17.8394 92.4159 48.9803 3.5881 1.4269 28.3501 15.3548 18.4575 40.2637 36.5971 39.4489 42.9950 67.0233 2.7580 18.2465 0.3812 0.2093 2.9252 11.8669 3.5092 0.0308 2.3618 25.9610 1.0342 0.4265 6.7629 57.8187 215.0112 3.9406 8.4608 35.8807 1.9874 16.3320 308.4169 70.6706 9.0411 17.4944 462.5440 0.1644 2.5996 0.6950 9.8041 5.8437 0.9465 35.8386 4.6976 36.3178 8.9878 70.9530 21.8491 3.2714 15.3370 30.5250 0.0531 17.0784 18.0097 7.2362 14.2171 16.4067 15.5752 9.0617 1.8643 151.5176 5.5256 222.4700 158.2177 212.3539 17.4074 3.6729 10.0896 2.0716 7.1785 0.2923 4.6600 0.3830 16.9496 10.1719 42.3231 32.3272 5.4366 19.3610 29.4000 32.3465
temp: 298.150 k
press: 1.00000 atm
elementType: 8 8 8 8 6 6 6 6 6 6 6 6 6 6 6 6 6 6 6 6 6 6 1 1 1 1 1 1 1 1 1 1 1 1 1 1 1 1
symmnumber: 1
zpe: 771116.2 jmol-1
zpe.correction: 0.293703 hartree
zpe.thermalcorrener: 0.313786 hartree
zpe.thermalcorrenthalpy: 0.314730 hartree
zpe.thermalcorrgfe: 0.239304 hartree
zpe.sumelectzpe: -994.851564 hartree
zpe.sumelectthermal: -994.831481 hartree
zpe.sumelectthermalent: -994.830536 hartree
zpe.sumelectthermalfe: -994.905962 hartree
dipole: -0.7759 -1.8129 -0.5685
dipole: 2.0523
quadrupole: -97.7713 -122.3718 -127.3775
quadrupole: 10.8963 1.7583 3.7678
quadrupole: 18.0689 -6.5316 -11.5373 10.8963 1.7583 3.7678
hfenergy: -995.1452663 hartree
pointgroup: C01 [X(C18H16O4)]
dipole: -0.2385229 -0.7577289 -0.1445223 debye
polarizability: 307.8708119|43.0878479|204.7436231|13.9127414|11.8179403|151.4811301 unknown
InChI: InChI=1S/C18H16O4/c19-17(12-11-14-7-3-1-4-8-14)22-16(18(20)21)13-15-9-5-2-6-10-15/h1-12,16,20H,13H2
charge 0 multiplicity 1
38 atoms
O  0.86047 0.783029 -0.541061
O  3.034049 3.722283 -0.216874
O  1.075344 3.448288 -1.444942
O  -0.174147 1.877085 1.252097
C  3.260659 0.785763 -0.936949
C  2.094038 1.520822 -0.227535
C  3.557321 -0.570885 -0.315089
C  4.52646 -0.690476 0.713963
C  2.861811 -1.733315 -0.734252
C  1.95845 2.970446 -0.710718
C  4.794371 -1.942084 1.313095
C  3.128275 -2.986593 -0.138897
C  4.095293 -3.095261 0.88755
C  -0.248525 1.06904 0.292913
C  -3.860038 -0.311212 0.232605
C  -1.415496 0.285019 -0.138168
C  -2.605776 0.390863 0.529695
C  -4.001382 -1.236201 -0.843803
C  -4.992702 -0.057087 1.059213
C  -5.230571 -1.880273 -1.079367
C  -6.224216 -0.702013 0.823033
C  -6.347912 -1.61703 -0.247813
H  2.995301 0.681659 -2.004972
H  4.147462 1.440806 -0.86956
H  2.248625 1.544599 0.866491
H  5.077042 0.199656 1.044227
H  2.105795 -1.649363 -1.523052
H  5.54812 -2.018429 2.104929
H  2.583714 -3.876606 -0.474248
H  4.303309 -4.067313 1.348704
H  -1.269257 -0.363147 -1.0071
H  -2.623047 1.081949 1.385742
H  -3.148186 -1.44908 -1.496978
H  -4.897606 0.652513 1.89021
H  2.949521 4.664344 -0.526279
H  -5.324604 -2.587816 -1.910516
H  -7.083638 -0.493264 1.469198
H  -7.302829 -2.120217 -0.435291
