program: Gaussian 09
title: 000275050
version: EM64L-G09RevD.01
frameworkgroup: C1[X(C9H18O7)]
method: RPBEPBE
basis: SDD
operation: Freq
keyword: #pfreq=noraman
keyword: PBEPBE/SDD
title: #p freq=noraman PBEPBE/SDD
converged: YES YES NO NO
title: Mulliken charges:
elementType: O O O O O O O C C C C C C C C C H H H H H H H H H H H H H H H H H H
charge: -0.486272 -0.470065 -0.436721 -0.446311 -0.399978 -0.231212 -0.294791 -0.118003 -0.174755 -0.105904 -0.109506 -0.227971 -0.713638 0.273884 -0.266795 -0.659963 0.195966 0.263578 0.207480 0.262215 0.281925 0.235778 0.196649 0.248564 0.390103 0.362914 0.379690 0.331739 0.334697 0.238191 0.235650 0.223954 0.234339 0.244568
chargesum: 0.00000
title: Mulliken charges with hydrogens summed into heavy atoms:
elementType: O O O O O O O C C C C C C C C C
charge: -0.096169 -0.107152 -0.057030 -0.114572 -0.065281 -0.231212 -0.294791 0.077962 0.088823 0.101576 0.152709 0.053954 -0.032646 0.273884 0.207046 0.042899
polarizability: 1.57016720e+02 1.76102977e+00 1.07855621e+02 -4.93211496e-01 4.03872526e+00 1.05810022e+02
1716.lowfreq: -8.4087 -4.4657 0.0006 0.0008 0.0009 0.9123 19.9442 36.1609 52.5741
frequency: 19.9420 36.1586 52.5218 62.0469 75.9787 84.6582 97.0040 130.8416 150.7834 189.7469 201.9481 217.3886 219.8603 229.6077 251.7200 262.8951 284.4246 292.1791 308.0951 322.8220 343.4912 393.0847 411.7172 434.6082 451.6639 461.3866 528.7707 558.3690 616.2018 662.7924 668.6758 679.1088 728.2482 733.6048 795.6523 812.0305 836.5202 843.0442 867.0278 916.8867 941.7150 967.2914 984.2916 1006.1129 1015.3420 1024.6656 1049.5818 1087.4455 1096.3341 1101.7066 1132.4554 1155.8871 1177.0211 1191.7263 1197.7282 1220.0532 1259.5327 1271.0403 1276.6219 1282.5353 1287.3125 1305.9944 1336.8591 1357.4157 1367.2557 1370.0077 1376.4339 1384.2268 1385.6759 1391.5295 1393.4264 1411.7997 1457.4256 1463.9962 1464.1078 1472.4418 1483.2656 1589.0574 2949.4426 2955.8797 2971.9828 2996.1865 3038.3042 3047.3811 3059.0618 3081.7634 3091.7586 3094.4048 3099.2626 3103.0704 3127.3355 3387.3904 3455.0381 3491.1273 3526.7497 3542.6377
redmass: 4.3185 3.2416 4.2973 4.9745 5.1251 4.3249 4.7842 4.6914 3.1337 5.4317 1.7214 1.2586 3.1603 5.1413 1.9061 1.7758 4.0046 2.4951 4.8688 1.1322 4.3098 4.1870 4.0730 3.2233 4.7476 3.4734 2.5725 1.3511 4.0486 1.8721 1.1374 1.6733 3.3871 4.6867 2.6116 1.6019 2.7648 3.9480 3.3320 3.6080 2.1652 4.4172 4.1713 2.6472 2.6064 1.6742 4.0620 3.1487 2.2069 2.5816 1.6493 1.6900 2.4813 1.4182 1.2149 1.3159 1.2289 1.3299 1.1330 1.2896 1.3526 1.5057 1.2639 1.3568 1.2962 1.2235 1.1988 1.3038 1.2589 1.3074 1.2336 1.5861 1.1078 1.0432 1.0507 1.0516 1.0526 7.1206 1.0824 1.0837 1.0409 1.0361 1.0597 1.0848 1.0890 1.0918 1.0974 1.0857 1.1025 1.1000 1.1074 1.0655 1.0656 1.0648 1.0659 1.0660
irintensity: 1.1516 0.9700 0.4064 1.5651 1.0441 0.6483 4.9787 1.7183 5.6440 5.7876 2.9436 8.8778 8.4561 5.1709 14.0904 130.5968 1.9645 71.0328 13.9442 99.9132 17.8951 15.4421 19.4909 4.4631 5.7765 8.3068 13.9351 115.8482 15.3844 155.7465 9.0907 256.5021 32.9008 10.2940 2.9894 12.6044 0.3265 4.1504 71.0824 31.7376 35.5966 40.3598 4.4447 75.7479 70.4587 44.6921 134.6923 19.9331 25.4245 7.0784 90.8951 1.1953 215.0214 71.4569 30.4278 47.0736 61.6908 2.8446 6.7376 6.7125 8.1804 95.3948 28.3084 5.7370 10.8375 3.9654 18.2117 33.9285 57.9970 65.8321 17.3765 3.5321 14.6843 12.1632 20.1738 8.4733 12.4633 188.1331 25.0222 55.9849 24.0985 15.7092 23.6108 7.8858 5.7804 40.2993 30.0302 6.7317 3.7193 16.5258 26.5558 328.7155 47.6630 20.5509 9.2752 3.8542
temp: 298.150 k
press: 1.00000 atm
elementType: 8 8 8 8 8 8 8 6 6 6 6 6 6 6 6 6 1 1 1 1 1 1 1 1 1 1 1 1 1 1 1 1 1 1
symmnumber: 1
zpe: 723678.5 jmol-1
zpe.correction: 0.275635 hartree
zpe.thermalcorrener: 0.294745 hartree
zpe.thermalcorrenthalpy: 0.295689 hartree
zpe.thermalcorrgfe: 0.227334 hartree
zpe.sumelectzpe: -878.975615 hartree
zpe.sumelectthermal: -878.956504 hartree
zpe.sumelectthermalent: -878.955560 hartree
zpe.sumelectthermalfe: -879.023916 hartree
dipole: -2.0404 -1.4833 -0.7768
dipole: 2.6394
quadrupole: -72.3289 -108.9048 -96.0585
quadrupole: 8.4745 4.9342 0.2117
quadrupole: 20.1018 -16.4741 -3.6277 8.4745 4.9342 0.2117
hfenergy: -879.2512495 hartree
pointgroup: C01 [X(C9H18O7)]
dipole: 0.7483236 0.6974457 0.1786588 debye
polarizability: 156.5562217|4.8158192|111.3878835|0.8949847|0.9774231|102.7382582 unknown
InChI: InChI=1S/C9H18O7/c1-3-16-9(15)8(14)7(13)6(12)5(11)4(2)10/h4-8,10-14H,3H2,1-2H3
charge 0 multiplicity 1
34 atoms
O  -0.954641 1.712301 0.323802
O  -2.794254 0.856085 -1.559345
O  -0.623711 -0.978376 -2.138951
O  -3.163864 -0.658108 1.890804
O  1.089356 -1.931207 0.187127
O  3.489224 -0.085765 -0.039436
O  1.760132 1.268685 0.712419
C  -1.040427 0.27443 0.03166
C  -2.501911 0.023943 -0.368983
C  -0.049097 -0.083016 -1.134618
C  -3.477423 0.301996 0.801454
C  1.264399 -0.75039 -0.669135
C  -4.948028 0.215922 0.379309
C  2.166691 0.262036 0.061881
C  4.491265 0.757715 0.7008
C  4.975718 1.906243 -0.185972
H  -0.845741 -0.308464 0.957943
H  -2.626471 -1.019394 -0.707207
H  0.213821 0.887117 -1.612659
H  -3.244565 1.285503 1.242909
H  1.794077 -1.139706 -1.552565
H  -5.606756 0.437612 1.236766
H  -5.193183 -0.795983 -0.002278
H  -5.159821 0.931709 -0.432899
H  -0.010415 1.88633 0.607045
H  -2.43585 1.761072 -1.346872
H  -1.410487 -0.498914 -2.521805
H  -3.614567 -1.517317 1.683861
H  0.436683 -1.724248 0.906481
H  4.017714 1.126658 1.626746
H  5.295059 0.043325 0.936468
H  5.777324 2.460777 0.335815
H  5.384647 1.525056 -1.137164
H  4.1569 2.612276 -0.4039
