program: Gaussian 09
title: 000275134
version: EM64L-G09RevD.01
frameworkgroup: C1[X(C22H30O4)]
method: RPBEPBE
basis: SDD
operation: Freq
keyword: #pfreq=noraman
keyword: PBEPBE/SDD
title: #p freq=noraman PBEPBE/SDD
converged: NO YES NO NO
title: Mulliken charges:
elementType: O O O O C C C C C C C C C C C C C C C C C C C C C C H H H H H H H H H H H H H H H H H H H H H H H H H H H H H H
charge: -0.460743 -0.294025 -0.218102 -0.205946 0.096931 -0.030697 -0.045229 -0.472433 -0.498406 -0.475875 -0.460811 -0.412353 -0.411079 -0.409032 -0.415505 -0.386709 -0.385610 0.138275 -0.414900 0.140385 0.292034 -0.335250 -0.338430 -0.240440 -0.223808 -0.217856 0.236689 0.234607 0.229103 0.204145 0.199163 0.266311 0.206208 0.239007 0.188288 0.241596 0.189321 0.195117 0.198611 0.190742 0.190446 0.197482 0.195216 0.194835 0.189939 0.194563 0.189429 0.195660 0.366486 0.260480 0.261466 0.241448 0.278671 0.235007 0.237956 0.237623
chargesum: 0.00000
title: Mulliken charges with hydrogens summed into heavy atoms:
elementType: O O O O C C C C C C C C C C C C C C C C C C C C C C
charge: -0.094257 -0.294025 -0.218102 -0.205946 0.096931 0.205992 0.189377 -0.039185 -0.032932 -0.030660 -0.030928 -0.027915 -0.021726 -0.021104 -0.025454 -0.002207 -0.000521 0.138275 0.107047 0.140385 0.292034 -0.093801 -0.059759 -0.005433 0.014148 0.019767
polarizability: 3.11629869e+02 -7.01545028e+00 2.56326750e+02 -6.63268480e+00 -3.13790858e+00 1.70705215e+02
1716.lowfreq: -19.7226 -5.9505 -0.0007 -0.0006 0.0006 8.7414 13.3152 24.2637 27.6524
frequency: 6.4461 22.3188 27.4220 47.7113 50.6377 57.8017 65.5117 76.2313 87.7106 112.7199 140.6106 151.5207 162.6957 186.0775 214.1477 219.3823 227.9996 237.0354 250.6000 271.4820 275.1393 296.6752 314.0749 320.8149 337.5819 364.1437 395.6017 397.1556 408.0841 425.7298 429.7077 434.7342 444.9415 462.4195 475.7182 486.7506 535.2954 563.3032 576.1379 612.8360 654.6030 679.7083 694.2737 733.4822 743.7472 772.9656 784.9571 785.5844 787.9466 794.8460 803.6396 839.1004 847.9750 857.1444 870.1262 884.3548 893.0705 897.5280 911.5629 916.9081 927.4399 936.2930 951.4141 970.2765 979.4652 989.3117 989.8809 993.0793 1013.4345 1020.9697 1030.2076 1047.6899 1048.6365 1051.8707 1056.1681 1062.7965 1064.8127 1084.1943 1088.6549 1091.3367 1108.8910 1114.0449 1118.8303 1141.1412 1154.6904 1175.9200 1183.1089 1190.3971 1200.8575 1228.3266 1231.9159 1240.2203 1247.2332 1254.4049 1259.4187 1265.7631 1272.0851 1281.9086 1291.9573 1301.8173 1313.3481 1316.9390 1319.7914 1327.3929 1332.1445 1333.9365 1335.9444 1337.8438 1339.1983 1340.5267 1340.6823 1346.9045 1358.3766 1368.8231 1389.2507 1415.1232 1437.6609 1459.9470 1460.4993 1462.9478 1463.2952 1464.2612 1466.9739 1471.1076 1471.6564 1477.4902 1481.0155 1483.3672 1577.7114 1602.9698 1617.3977 1645.5464 2947.0244 2958.9375 2960.0326 2963.2069 2963.3378 2965.0094 2965.9929 2969.3064 2976.1001 2977.7839 2984.0900 2989.6908 2999.4356 3021.4021 3023.5292 3024.3327 3024.4921 3032.9843 3034.3895 3040.9497 3047.1827 3048.9413 3053.5523 3086.3102 3131.3002 3138.8947 3149.8300 3160.3125 3171.5759 3550.0516
redmass: 4.3120 4.6546 5.0828 3.9534 4.2703 5.4935 2.9968 3.9413 3.1660 5.4272 5.8335 4.9069 3.5278 2.7241 2.3817 1.8822 3.4404 2.4752 2.6477 3.5882 2.1467 2.9183 6.8269 2.2362 1.9256 2.7197 4.6666 3.0079 3.2588 3.2204 3.0308 3.0233 2.4114 4.9339 2.1100 1.7906 3.2927 2.7601 3.6332 6.4422 6.7763 4.4689 1.8150 3.7200 3.3447 2.0217 2.0180 2.9628 1.4802 2.6652 2.7657 2.1993 1.9393 1.2523 2.1489 1.9479 1.4746 1.4646 2.3242 2.1166 2.4855 1.4323 4.1227 2.5322 2.8764 3.3210 2.4765 1.6684 1.4303 2.9353 2.2029 2.2958 1.6823 1.6421 1.7042 1.7342 1.2616 1.5376 1.6077 2.0502 2.9001 2.5106 3.2516 2.3236 2.6262 1.0644 1.5136 1.1252 1.5744 1.3333 2.4520 1.2958 1.2974 1.2976 1.2891 1.2816 1.2465 1.2424 1.3015 1.2648 1.2382 1.3567 1.4109 1.4272 1.3714 1.3910 1.4662 1.4495 1.4686 1.4649 1.4649 1.4792 1.4513 1.4241 9.1012 1.1020 2.2599 1.0868 1.0885 1.0894 1.0882 1.0879 1.0832 1.0879 1.0900 1.0932 2.2128 1.0907 6.5083 6.7546 7.4634 10.7688 1.0671 1.0626 1.0629 1.0611 1.0614 1.0649 1.0639 1.0714 1.0690 1.0786 1.0634 1.0637 1.0599 1.0958 1.0982 1.0964 1.0950 1.1011 1.1023 1.1017 1.1008 1.0998 1.0992 1.1008 1.0854 1.0883 1.0923 1.0963 1.1015 1.0654
irintensity: 0.1031 0.8836 1.3622 0.8674 0.6824 1.3835 0.1607 0.9180 0.6153 1.0612 1.8662 1.5426 1.3841 5.7459 20.2369 35.8161 0.3200 20.4647 22.2661 5.8748 14.6447 8.2438 7.2368 6.9943 3.4940 12.1681 10.5607 0.8183 0.8204 0.5931 1.3982 0.0800 3.3038 11.3480 2.6618 4.5654 4.7204 8.0654 6.1467 0.3385 19.6903 4.2173 45.7885 1.3268 56.7693 29.2670 0.8091 3.7959 1.0520 1.3632 11.7439 3.5557 8.6668 0.7888 3.4862 16.9069 8.4930 11.5567 5.8581 3.1382 6.4757 1.8497 151.2132 22.7568 27.5332 0.7455 6.8970 3.1295 1.2450 1.8269 8.5382 16.1921 15.9886 8.8385 1.3699 32.2908 10.9492 32.9078 9.6967 66.3108 72.7849 26.9788 177.3805 21.5461 15.1447 1.3879 0.0502 15.8408 3.2787 13.4315 95.4260 19.8982 8.5618 1.0077 1.7974 5.4196 0.2337 2.7335 4.1935 12.7891 6.6878 1.2957 43.5824 11.7802 2.6104 1.0215 2.0506 51.4519 3.4635 6.5864 0.6510 3.1330 3.0955 1.5704 2.1144 27.4156 24.4176 4.1959 4.4075 7.4183 5.3721 2.2443 38.4565 10.3612 5.7867 4.6897 1.0713 1.9367 76.9631 82.9597 27.8193 81.4671 27.5728 24.0211 48.1463 27.7973 46.6115 44.9972 37.7640 0.5810 14.9679 15.7221 16.0835 36.1780 45.6406 78.0347 114.1924 69.3813 41.4594 32.0292 50.9810 5.4007 60.8503 70.4352 53.5189 2.9625 1.6229 5.0319 15.6810 16.1308 23.2658 42.0573
temp: 298.150 k
press: 1.00000 atm
elementType: 8 8 8 8 6 6 6 6 6 6 6 6 6 6 6 6 6 6 6 6 6 6 6 6 6 6 1 1 1 1 1 1 1 1 1 1 1 1 1 1 1 1 1 1 1 1 1 1 1 1 1 1 1 1 1 1
symmnumber: 1
zpe: 1249543.4 jmol-1
zpe.correction: 0.475926 hartree
zpe.thermalcorrener: 0.501257 hartree
zpe.thermalcorrenthalpy: 0.502201 hartree
zpe.thermalcorrgfe: 0.417944 hartree
zpe.sumelectzpe: -1155.259932 hartree
zpe.sumelectthermal: -1155.234601 hartree
zpe.sumelectthermalent: -1155.233657 hartree
zpe.sumelectthermalfe: -1155.317914 hartree
dipole: 4.5436 -2.2672 0.0123
dipole: 5.0778
quadrupole: -124.1107 -150.4608 -163.6990
quadrupole: -6.9697 1.7997 -2.2895
quadrupole: 21.9795 -4.3706 -17.6088 -6.9697 1.7997 -2.2895
hfenergy: -1155.7358584 hartree
pointgroup: C01 [X(C22H30O4)]
dipole: -1.9610375 -0.3217605 0.204688 debye
polarizability: 309.3941975|-11.3302181|256.2189957|-14.2913842|-9.4591016|173.0486412 unknown
InChI: InChI=1S/C22H30O4/c23-20(17-10-4-1-5-11-17)16-26-21(24)22(25,18-12-6-2-7-13-18)19-14-8-3-9-15-19/h1,4-5,10-11,18-19,25H,2-3,6-9,12-16H2
charge 0 multiplicity 1
56 atoms
O  1.689997 -0.624268 -1.984949
O  -0.641005 -0.583839 -0.840838
O  0.132899 -0.381484 1.347306
O  -1.720068 1.901398 -0.476542
C  1.78071 -0.523201 -0.516763
C  2.530434 0.80319 -0.127379
C  2.517655 -1.835854 -0.062999
C  3.999484 0.804596 -0.622031
C  1.787421 2.048854 -0.680478
C  2.978093 -1.856521 1.416478
C  1.676217 -3.099945 -0.381278
C  4.724605 2.116672 -0.234967
C  2.503531 3.358823 -0.278974
C  3.771777 -3.150511 1.726195
C  2.47062 -4.391815 -0.079771
C  3.974346 3.364547 -0.755399
C  2.95542 -4.420343 1.389011
C  0.383041 -0.478837 0.128446
C  -2.01661 -0.513455 -0.338831
C  -2.508873 0.944441 -0.250182
C  -3.943554 1.166739 0.118411
C  -4.832227 0.097712 0.418329
C  -4.422088 2.504948 0.172452
C  -6.173573 0.364845 0.763943
C  -5.761345 2.769175 0.516828
C  -6.640744 1.699112 0.813135
H  2.521468 0.865189 0.981097
H  3.418303 -1.873845 -0.710842
H  3.998335 0.68193 -1.723189
H  4.557543 -0.053578 -0.202372
H  1.755023 1.979169 -1.786907
H  0.738664 2.07433 -0.329501
H  3.611278 -0.978635 1.643152
H  2.0942 -1.79198 2.079842
H  0.756066 -3.099316 0.242248
H  1.362181 -3.071414 -1.440044
H  4.803345 2.177359 0.871078
H  5.760405 2.099852 -0.627569
H  1.958672 4.226256 -0.699606
H  2.475027 3.468948 0.825406
H  4.709129 -3.155074 1.13098
H  4.069951 -3.159145 2.79278
H  1.844876 -5.279993 -0.295625
H  3.348563 -4.447172 -0.756666
H  3.996786 3.366248 -1.865023
H  4.486974 4.287614 -0.420426
H  2.074595 -4.476258 2.062092
H  3.562496 -5.327474 1.57715
H  0.79311 -0.309211 -2.266553
H  -2.620584 -1.092724 -1.056699
H  -2.067962 -0.98092 0.663755
H  -4.488453 -0.942052 0.392162
H  -3.72124 3.314175 -0.058145
H  -6.853189 -0.461833 0.996554
H  -6.122946 3.802166 0.556486
H  -7.682879 1.904106 1.082032
