program: Gaussian 09
title: 000022339
version: EM64L-G09RevD.01
frameworkgroup: C1[X(C12H19N3O)]
method: RPBEPBE
basis: SDD
operation: Freq
keyword: #p
keyword: freq=noraman
keyword: PBEPBE/SDD
title: #p freq=noraman PBEPBE/SDD
converged: YES YES NO NO
title: Mulliken charges:
elementType: O N N N C C C C C C C C C C C C H H H H H H H H H H H H H H H H H H H
charge: -0.278121 -0.091657 -0.369106 -0.001406 -0.360231 -0.326964 -0.325541 -0.397158 -0.700974 -0.673056 0.182225 0.278072 -0.282087 -0.304805 -0.327940 -0.336024 0.201110 0.247593 0.203576 0.183965 0.201686 0.182709 0.270295 0.224106 0.260408 0.214383 0.204860 0.211926 0.224618 0.207257 0.301153 0.274435 0.211978 0.246407 0.242307
chargesum: 0.00000
title: Mulliken charges with hydrogens summed into heavy atoms:
elementType: O N N N C C C C C C C C C C C C
charge: -0.278121 -0.091657 -0.067953 -0.001406 0.088472 0.060577 0.058854 0.097243 -0.021323 -0.029256 0.182225 0.278072 -0.007652 -0.092827 -0.081533 -0.093717
polarizability: 2.21186766e+02 -3.94121768e+00 1.55988530e+02 7.05706996e+00 7.33723273e-01 9.61213140e+01
1716.lowfreq: -6.0429 -5.1840 -0.0007 -0.0005 0.0003 7.7952 18.2531 29.2354 34.9371
frequency: 17.0322 28.9827 34.0653 39.7180 65.1411 70.5014 114.2158 129.1722 147.1301 190.6910 240.4571 244.6726 271.9707 287.7174 300.1865 316.2136 364.1366 378.5846 395.0077 434.2714 462.9056 497.6310 515.3214 537.2062 656.6857 660.1808 695.2633 743.4957 752.0710 755.4368 797.7132 804.3679 828.7594 837.5699 889.5421 919.2752 957.7383 963.0575 985.8838 989.3865 996.9470 1037.6727 1060.5885 1068.6397 1074.4592 1082.2473 1084.5938 1090.9490 1124.1729 1144.0873 1178.1750 1211.3982 1219.4369 1249.1462 1274.0175 1287.2528 1291.1674 1300.0688 1312.4734 1323.7521 1326.6638 1354.8326 1365.0901 1382.1324 1390.0675 1396.6122 1398.6758 1440.2086 1457.5329 1464.6281 1465.1431 1471.8689 1476.6803 1484.5490 1489.0412 1490.9270 1499.6956 1543.1040 1581.6314 1594.7455 2842.5802 2851.4255 2956.6820 2978.8421 2984.8580 3010.5439 3020.8062 3030.2736 3034.7934 3075.8748 3078.4220 3084.5837 3091.5066 3099.5195 3122.4726 3139.6544 3147.4445 3173.7469 3563.5695
redmass: 3.5566 3.9769 3.4733 5.5804 2.7128 2.9053 2.1863 3.3319 3.0844 2.7073 2.1379 1.3520 2.2764 1.5637 4.1651 3.0567 2.4686 3.0219 4.0245 3.9926 2.6351 4.1722 1.4667 2.4252 5.1246 6.8249 4.1329 1.4335 2.8352 2.6494 1.1935 1.2015 2.2019 1.9311 1.2652 1.9207 2.6870 2.1355 2.7601 1.5120 3.2238 3.4636 2.0489 2.0204 2.3733 2.6124 1.6230 1.6721 1.7273 3.1028 1.8163 2.3854 1.2922 1.5269 2.0140 1.2142 1.1882 5.9359 1.2820 1.4933 1.2400 1.2847 1.3282 1.3078 1.2350 1.2314 1.8502 1.1469 1.7688 1.0639 1.0561 1.0636 1.0799 1.0652 1.9752 1.0638 1.0711 7.3592 5.6139 7.4255 1.0718 1.0709 1.0583 1.0357 1.0359 1.0970 1.0921 1.0623 1.0874 1.0989 1.0984 1.1010 1.1006 1.1061 1.0875 1.0896 1.0973 1.0963 1.0778
irintensity: 0.1782 0.4419 0.6569 1.3584 3.8362 2.7563 0.3096 1.4871 8.4154 4.4007 0.6225 0.8997 3.0784 0.8725 6.7561 11.0797 0.3468 3.5485 5.8635 2.7383 4.2523 2.2243 64.9560 51.8284 10.6230 3.1719 33.4246 6.0213 17.5604 0.7111 7.8174 4.0506 11.2896 30.2899 4.0000 0.3643 1.5808 1.3519 2.0743 2.2653 3.9775 8.2436 11.7435 24.9119 13.4395 18.6511 0.9278 33.4248 16.5091 3.8812 26.8504 42.7947 1.1541 16.5299 82.6052 19.7240 5.4611 0.0872 12.7424 2.5867 6.5901 18.2949 2.9258 2.4402 25.9995 16.0106 9.1451 41.6247 43.3212 5.1487 4.9303 3.5630 4.0861 12.9329 199.3822 12.1236 17.9597 62.3097 12.6521 82.4657 36.0734 206.6372 36.2100 25.9905 34.8817 4.2620 34.6870 34.0516 37.3823 33.8593 60.0513 33.2953 45.2782 12.0915 8.5549 29.4712 18.0157 5.3812 13.4469
temp: 298.150 k
press: 1.00000 atm
elementType: 8 7 7 7 6 6 6 6 6 6 6 6 6 6 6 6 1 1 1 1 1 1 1 1 1 1 1 1 1 1 1 1 1 1 1
symmnumber: 1
zpe: 778123.2 jmol-1
zpe.correction: 0.296371 hartree
zpe.thermalcorrener: 0.313542 hartree
zpe.thermalcorrenthalpy: 0.314486 hartree
zpe.thermalcorrgfe: 0.248398 hartree
zpe.sumelectzpe: -706.907394 hartree
zpe.sumelectthermal: -706.890223 hartree
zpe.sumelectthermalent: -706.889279 hartree
zpe.sumelectthermalfe: -706.955367 hartree
dipole: 2.4418 -3.2445 0.2759
dipole: 4.0700
quadrupole: -110.4439 -90.7185 -99.1755
quadrupole: -1.9276 -4.3230 -1.0442
quadrupole: -10.3313 9.3941 0.9371 -1.9276 -4.3230 -1.0442
hfenergy: -707.2037652 hartree
pointgroup: C01 [X(C12H19N3O1)]
dipole: -0.916281 -1.306309 0.1342082 debye
polarizability: 220.5910329|7.7473793|153.8761099|7.7595221|-11.854806|98.8294675 unknown
InChI: InChI=1S/C12H19N3O/c1-3-15(4-2)10-9-14-12(16)11-5-7-13-8-6-11/h5-8,14H,3-4,9-10H2,1-2H3
charge 0 multiplicity 1
35 atoms
O  0.451238 1.536695 -0.299902
N  -3.547813 -0.237096 0.24917
N  0.165554 -0.764263 -0.447844
N  5.206355 -0.129238 0.567537
C  -2.117472 -0.446129 0.573704
C  -4.009032 1.159908 0.464584
C  -4.463169 -1.265085 0.809826
C  -1.280957 -0.654107 -0.719673
C  -3.308627 2.181732 -0.451735
C  -5.776221 -1.411754 0.015042
C  0.938898 0.36146 -0.238095
C  2.40638 0.135806 0.04805
C  3.290893 1.227494 -0.132271
C  2.952293 -1.088034 0.512991
C  4.665942 1.049772 0.130249
C  4.342315 -1.170321 0.756142
H  -1.991358 -1.327464 1.234695
H  -1.696825 0.4243 1.116877
H  -5.095399 1.191185 0.264778
H  -3.868803 1.466121 1.533784
H  -3.931079 -2.234696 0.779581
H  -4.701297 -1.065056 1.886453
H  -1.447703 0.209317 -1.384564
H  -1.618535 -1.564675 -1.244513
H  -2.21583 2.208808 -0.289911
H  -3.496048 1.937562 -1.512928
H  -3.701979 3.196211 -0.253214
H  -6.392848 -0.496256 0.056369
H  -5.555191 -1.627059 -1.045111
H  -6.382888 -2.239336 0.427942
H  0.604033 -1.685191 -0.456844
H  2.888395 2.188768 -0.464792
H  2.326938 -1.96385 0.721553
H  5.374237 1.873873 -0.00832
H  4.790904 -2.100905 1.121889
