program: Gaussian 09
title: 000275040
version: EM64L-G09RevD.01
frameworkgroup: C1[X(C26H18O2)]
method: RPBEPBE
basis: SDD
operation: Freq
keyword: #pfreq=noraman
keyword: PBEPBE/SDD
title: #p freq=noraman PBEPBE/SDD
converged: YES YES NO NO
title: Mulliken charges:
elementType: O O C C C C C C C C C C C C C C C C C C C C C C C C C C H H H H H H H H H H H H H H H H H H
charge: -0.211552 -0.211557 0.355198 0.355206 0.332672 0.332661 0.338728 0.338743 -0.399063 -0.399040 -0.392024 -0.391996 -0.336054 -0.336071 -0.378877 -0.378875 -0.016404 -0.016382 -0.390599 -0.390577 -0.388731 -0.388711 -0.236517 -0.236521 -0.236371 -0.236387 -0.236925 -0.236929 0.242331 0.242307 0.243253 0.243244 0.264082 0.264090 0.274030 0.274037 0.239901 0.239892 0.241490 0.241469 0.229087 0.229083 0.229380 0.229383 0.232947 0.232949
chargesum: 0.00000
title: Mulliken charges with hydrogens summed into heavy atoms:
elementType: O O C C C C C C C C C C C C C C C C C C C C C C C C C C
charge: -0.211552 -0.211557 0.355198 0.355206 0.332672 0.332661 0.338728 0.338743 -0.156732 -0.156733 -0.148771 -0.148753 -0.071972 -0.071981 -0.104848 -0.104839 -0.016404 -0.016382 -0.150697 -0.150685 -0.147241 -0.147242 -0.007430 -0.007438 -0.006991 -0.007004 -0.003978 -0.003980
polarizability: 6.04385627e+02 1.94867474e+01 2.61426104e+02 -1.86680558e-02 -6.58506325e-02 1.68663818e+02
1716.lowfreq: -3.0195 -0.0008 0.0007 0.0009 3.1105 4.3809 9.6231 25.0313 26.4516
frequency: 9.5722 25.0300 26.4228 47.9553 56.0614 66.1967 74.7490 86.7025 88.9858 135.7490 144.2731 156.6013 157.9484 218.7695 244.4286 268.5781 292.5642 296.9677 332.5645 361.5864 393.3734 401.3279 402.4033 402.5089 406.7318 407.5361 460.0506 477.7728 493.7283 506.9339 547.9983 552.2210 612.4910 612.9504 624.2538 632.5892 637.8681 647.5847 687.4466 700.5889 700.7547 713.0471 723.8338 743.8050 758.6321 760.4082 776.7581 794.4752 839.2148 847.1243 849.3666 850.5528 851.6911 861.8279 879.0617 924.8381 925.0129 975.9334 975.9892 976.8154 977.2788 988.0585 988.2853 994.9497 995.3577 995.9657 996.3459 997.0927 997.0998 1007.1300 1016.3435 1035.2509 1040.4861 1047.4178 1086.9750 1086.9777 1127.3960 1127.5018 1175.1993 1175.2107 1188.4677 1193.4157 1195.5862 1210.0386 1231.2036 1292.1456 1292.9382 1301.8240 1308.2383 1308.6667 1317.9383 1317.9497 1358.7415 1358.8475 1377.8722 1377.8889 1421.3416 1422.1301 1437.8543 1438.2121 1475.3123 1475.4729 1511.5982 1511.9714 1526.6791 1531.7619 1563.0715 1565.3946 1586.7782 1586.8402 1610.6063 1610.8344 1616.6873 1617.8593 3126.0820 3126.1040 3130.6868 3130.7151 3137.8093 3137.8550 3142.3047 3142.3479 3145.2138 3145.2455 3152.2991 3152.3174 3160.0259 3160.1842 3167.4950 3167.5564 3177.5353 3177.5936
redmass: 7.1106 4.4287 3.6730 6.1200 6.4148 4.4648 3.7269 5.5232 5.6418 8.2924 5.6040 6.0524 6.0761 5.9006 8.6812 6.0276 5.8552 6.0588 8.7187 5.9354 4.3385 4.2346 2.9827 2.8489 2.8745 2.8594 5.7244 4.1735 5.8155 4.1393 2.8687 2.8955 6.6151 6.5389 7.1893 6.9238 7.1103 6.3156 5.4480 1.7363 1.7822 4.3377 4.8068 2.9191 5.8256 1.9190 2.2185 3.6516 2.9796 1.3203 1.2797 1.2503 1.3229 1.5386 2.4378 1.4471 1.4555 1.4750 1.4762 1.3799 1.3951 4.2474 4.1611 1.6805 4.1131 4.0041 1.6189 1.3264 1.3314 4.0888 2.7623 2.5132 1.9090 2.2291 1.6231 1.6232 1.3944 1.3868 1.0539 1.0537 1.3414 1.1160 1.2097 1.1356 2.1705 2.6066 2.8470 4.8046 1.4265 1.4387 1.4321 1.3829 2.8458 2.7300 9.3512 9.4011 4.3354 4.1915 2.3953 2.3880 2.1294 2.1668 3.0020 2.7565 6.8955 10.3037 6.6464 7.1826 6.2728 6.3338 5.9504 5.9670 6.2663 6.3231 1.0847 1.0847 1.0875 1.0875 1.0878 1.0878 1.0905 1.0906 1.0904 1.0904 1.0961 1.0961 1.0961 1.0961 1.1016 1.1016 1.0952 1.0952
irintensity: 0.6926 0.2279 0.0067 0.1009 0.4423 0.8350 0.0793 0.0002 0.6531 2.0179 0.2159 4.6185 1.9596 0.0002 11.1328 0.2734 12.1204 23.1992 0.2578 0.0443 15.7899 1.8564 0.2520 0.2452 0.3997 4.8954 5.2399 2.2940 12.5151 17.5124 5.3569 1.3399 1.9155 0.0357 28.6213 0.7686 8.5350 8.7422 3.6936 16.5627 76.1588 72.1314 85.7320 73.5348 10.4476 25.0149 73.1567 17.2735 124.2178 10.4955 0.5590 0.0039 17.0829 48.6997 53.6671 0.9539 1.8058 0.1579 2.0484 0.0227 3.2060 0.0102 0.7607 0.0183 27.1881 2.4389 1.7588 0.1016 0.1206 0.0203 1.3107 0.2746 3.2732 0.5306 0.7807 15.8225 16.3285 0.2135 0.7075 0.0386 424.1476 0.0282 161.1353 2.1579 210.8316 0.1486 15.6343 17.1960 0.4674 1.8285 4.6065 5.6486 5.8765 24.9710 1.0387 3.4810 0.4269 34.5608 0.0073 18.2896 31.7173 0.6499 9.6240 1.5979 94.1454 603.5569 138.5962 34.9257 3.0999 2.9315 36.6145 1.3544 221.1752 14.8165 11.5041 2.0691 0.9286 0.8895 10.9323 2.2096 29.8472 8.3449 1.4533 0.3248 22.4873 46.5903 21.2290 0.5278 63.2595 6.1145 2.9470 2.5049
temp: 298.150 k
press: 1.00000 atm
elementType: 8 8 6 6 6 6 6 6 6 6 6 6 6 6 6 6 6 6 6 6 6 6 6 6 6 6 6 6 1 1 1 1 1 1 1 1 1 1 1 1 1 1 1 1 1 1
symmnumber: 1
zpe: 933727.6 jmol-1
zpe.correction: 0.355638 hartree
zpe.thermalcorrener: 0.378204 hartree
zpe.thermalcorrenthalpy: 0.379148 hartree
zpe.thermalcorrgfe: 0.300276 hartree
zpe.sumelectzpe: -1150.140293 hartree
zpe.sumelectthermal: -1150.117728 hartree
zpe.sumelectthermalent: -1150.116783 hartree
zpe.sumelectthermalfe: -1150.195655 hartree
dipole: 0.0003 -0.0028 -3.7508
dipole: 3.7508
quadrupole: -108.9395 -149.0255 -174.4488
quadrupole: -1.0600 0.0019 -0.0193
quadrupole: 35.1984 -4.8876 -30.3108 -1.0600 0.0019 -0.0193
hfenergy: -1150.4959311 hartree
pointgroup: C01 [X(C26H18O2)]
dipole: -0.0002942 1.4756745 -0.0076238 debye
polarizability: 604.528939|0.2185953|168.6663042|18.1801698|0.4809212|261.2803066 unknown
InChI: InChI=1S/C26H18O2/c27-25(23-15-11-21(12-16-23)19-7-3-1-4-8-19)26(28)24-17-13-22(14-18-24)20-9-5-2-6-10-20/h1-18H
charge 0 multiplicity 1
46 atoms
O  -0.105461 -1.829476 1.710302
O  0.104006 -1.846738 -1.688136
C  -4.556295 0.158876 0.153725
C  4.553711 0.159951 -0.152255
C  -1.88203 -0.841011 0.398181
C  1.880032 -0.843945 -0.386239
C  -5.946539 0.675674 0.023784
C  5.943706 0.678764 -0.027755
C  -3.63972 0.236643 -0.932978
C  3.637198 0.248228 0.933714
C  -4.10105 -0.431393 1.369976
C  4.098718 -0.442991 -1.362371
C  -2.327374 -0.255077 -0.819849
C  2.325135 -0.245417 0.825735
C  -2.791988 -0.919846 1.490824
C  2.789935 -0.933398 -1.478111
C  -0.496995 -1.345811 0.601619
C  0.495301 -1.351633 -0.584422
C  -6.631204 1.225575 1.143861
C  6.628117 1.217205 -1.153544
C  -6.62839 0.630834 -1.224756
C  6.625611 0.647327 1.221156
C  -7.948451 1.714793 1.019906
C  7.945151 1.708267 -1.034724
C  -7.94657 1.117006 -1.348833
C  7.94357 1.135377 1.340146
C  -8.613684 1.662621 -0.227196
C  8.610428 1.66951 0.212846
H  -3.952889 0.711479 -1.868848
H  3.950216 0.732718 1.864684
H  -4.793944 -0.534616 2.211943
H  4.791598 -0.554485 -2.20329
H  -1.650265 -0.19225 -1.675673
H  1.648072 -0.174366 1.680959
H  -2.444294 -1.380292 2.421677
H  2.442411 -1.403561 -2.404154
H  -6.118131 1.300877 2.109191
H  6.115045 1.282174 -2.11962
H  -6.136636 0.18171 -2.094862
H  6.134063 0.207079 2.095894
H  -8.45284 2.143582 1.892885
H  8.44935 2.128069 -1.912169
H  -8.456665 1.062223 -2.316899
H  8.453673 1.090951 2.308735
H  -9.637254 2.040963 -0.323498
H  9.633819 2.049328 0.305142
