program: Gaussian 09
title: 000275016
version: EM64L-G09RevD.01
frameworkgroup: C1[X(C15H26O3)]
method: RPBEPBE
basis: SDD
operation: Freq
keyword: #pfreq=noraman
keyword: PBEPBE/SDD
title: #p freq=noraman PBEPBE/SDD
converged: NO YES NO NO
title: Mulliken charges:
elementType: O O O C C C C C C C C C C C C C C C H H H H H H H H H H H H H H H H H H H H H H H H H H
charge: -0.474009 -0.404830 -0.253506 -0.028373 0.131031 -0.018543 -0.504850 -0.484323 -0.005210 -0.469385 -0.472416 -0.421989 -0.416761 -0.416057 -0.409650 -0.385768 0.043610 -0.753257 0.243126 0.236341 0.203060 0.236462 0.226796 0.208176 0.191746 0.234316 0.193261 0.229963 0.204952 0.198073 0.192359 0.196071 0.189598 0.199479 0.195992 0.192795 0.198098 0.198304 0.188919 0.212328 0.212772 0.212293 0.364024 0.384980
chargesum: 0.00000
title: Mulliken charges with hydrogens summed into heavy atoms:
elementType: O O O C C C C C C C C C C C C C C C
charge: -0.109985 -0.019849 -0.253506 0.214754 0.131031 0.217797 -0.065328 -0.049351 0.186536 -0.041808 -0.037500 -0.031557 -0.031092 -0.020586 -0.018757 0.001456 0.043610 -0.115864
polarizability: 1.82739197e+02 -9.70405825e-01 1.69330598e+02 -2.42324828e-01 1.15356768e+00 1.43179815e+02
1716.lowfreq: -15.3292 -0.0004 -0.0001 0.0001 10.1299 27.0260 48.4809 60.0880 67.7474
frequency: 48.3398 60.0771 67.7311 77.4189 95.0006 109.4490 150.2723 166.8033 190.3880 208.5488 214.5642 224.1220 243.3908 253.9718 283.0650 306.8421 321.5392 343.6036 366.8371 396.7169 402.7462 423.7887 427.6533 432.5605 447.5221 475.1678 495.3518 530.8838 559.3946 612.7645 643.3069 732.8113 750.1392 774.8458 787.8915 805.4498 842.4113 848.1758 853.2156 869.7296 893.0067 893.7369 898.3587 913.5501 938.1256 953.0295 972.1990 982.5789 987.3566 1023.3025 1049.7492 1057.9570 1062.4673 1070.8470 1073.4679 1086.6709 1091.5490 1110.4359 1114.4610 1120.1986 1143.2148 1157.6068 1171.0712 1194.5973 1215.8135 1237.2037 1251.3128 1256.4342 1259.2441 1263.4349 1275.6350 1283.2061 1284.9338 1293.2243 1304.7388 1310.8227 1324.6482 1334.6374 1335.1629 1336.5502 1339.1168 1342.4495 1342.8139 1348.5976 1356.1602 1362.4685 1373.5626 1382.5072 1456.9735 1458.2139 1461.0660 1462.6993 1463.7435 1466.2950 1470.4720 1472.3412 1474.8924 1476.7724 1482.8258 1618.6811 2934.4510 2953.8641 2959.5240 2961.2163 2963.2100 2965.4371 2965.5643 2967.3231 2968.9263 2976.7669 2978.4423 2982.6768 2992.5041 3020.2755 3023.5176 3026.1472 3027.0767 3035.2084 3036.8049 3041.7886 3046.8587 3055.1181 3061.5545 3063.6397 3465.2872 3500.4486
redmass: 3.4356 3.8584 5.1834 3.5552 3.4492 4.5800 2.7374 2.5467 2.9555 1.7113 1.7263 2.1722 3.0412 3.3884 2.3400 2.4338 2.7954 2.6764 3.1972 1.3713 3.2065 3.0014 3.0811 1.8637 2.2360 2.1888 2.1017 2.0373 2.3953 3.4067 1.8301 3.2090 3.9704 2.2430 1.4595 2.8024 1.9010 1.4384 1.7807 2.1460 2.1436 1.8283 1.7240 1.9109 1.7239 2.3362 2.9374 1.7658 1.6392 2.8933 1.8253 1.2088 2.2317 1.3111 1.6452 1.3800 2.2696 2.9916 2.3802 2.6127 2.3361 2.5202 2.2077 1.6274 1.3761 1.3334 1.3546 1.3358 1.2991 1.3264 1.5397 1.1901 1.2615 1.2947 1.2868 1.2440 1.3493 1.4013 1.3957 1.4041 1.4919 1.5043 1.5410 1.5490 1.4796 1.5516 1.7641 1.2209 1.0886 1.0870 1.0897 1.0886 1.0881 1.0854 1.0870 1.0640 1.0694 1.0679 1.0882 8.5650 1.0820 1.0663 1.0594 1.0621 1.0622 1.0559 1.0433 1.0634 1.0623 1.0712 1.0762 1.0722 1.0634 1.0967 1.1013 1.0951 1.0980 1.1021 1.1014 1.1015 1.0977 1.1016 1.0992 1.0992 1.0652 1.0639
irintensity: 0.1184 0.6562 0.5763 0.0197 1.2533 1.4833 0.1185 0.1113 1.1150 0.2981 0.0311 0.4154 5.0947 10.9929 11.8506 3.9862 3.2796 23.2183 8.5286 55.1126 4.1310 7.7676 3.4584 1.6790 2.7249 1.4495 1.6579 9.5370 23.6313 29.6317 115.5927 13.5942 9.6577 0.4183 0.0409 3.5605 8.0053 4.0594 3.2152 3.8219 1.3108 13.1130 7.0541 2.7377 11.3896 11.7725 39.8165 4.9156 41.2596 67.0224 3.8197 5.2239 111.5792 1.9521 25.2692 2.8787 6.5622 1.5862 1.4811 1.2726 0.7700 8.6441 1.3398 3.2685 3.5117 1.6914 4.9156 0.5604 3.9721 7.8382 45.4529 3.7246 22.6370 2.2493 3.3494 2.6632 1.7478 0.9115 0.7688 2.0730 2.6607 2.2068 4.7257 1.8094 6.4300 7.9106 9.1086 9.2354 0.7829 4.7419 2.6950 3.2124 9.6838 21.5811 7.6358 7.1823 17.2886 4.5197 0.7849 193.8367 15.5419 20.4711 35.1468 30.7808 27.3706 68.7372 29.0410 41.4488 43.7111 9.0965 5.9726 25.0405 29.6125 78.4746 30.5295 63.8506 70.0495 10.5419 42.4274 75.2641 28.6861 70.1194 68.7007 46.7173 47.6646 30.0944
temp: 298.150 k
press: 1.00000 atm
elementType: 8 8 8 6 6 6 6 6 6 6 6 6 6 6 6 6 6 6 1 1 1 1 1 1 1 1 1 1 1 1 1 1 1 1 1 1 1 1 1 1 1 1 1 1
symmnumber: 1
zpe: 1016570.5 jmol-1
zpe.correction: 0.387191 hartree
zpe.thermalcorrener: 0.405803 hartree
zpe.thermalcorrenthalpy: 0.406747 hartree
zpe.thermalcorrgfe: 0.341700 hartree
zpe.sumelectzpe: -811.438816 hartree
zpe.sumelectthermal: -811.420205 hartree
zpe.sumelectthermalent: -811.419261 hartree
zpe.sumelectthermalfe: -811.484307 hartree
dipole: -0.3024 -0.2131 -2.2720
dipole: 2.3019
quadrupole: -108.5693 -111.7488 -111.6711
quadrupole: 0.2813 1.5750 -5.4519
quadrupole: 2.0938 -1.0857 -1.0080 0.2813 1.5750 -5.4519
hfenergy: -811.8260077 hartree
pointgroup: C01 [X(C15H26O3)]
dipole: 0.1166148 0.0027109 -0.8981128 debye
polarizability: 182.7440015|-0.9288873|168.9044652|0.2336004|-3.4911037|143.6011437 unknown
InChI: InChI=1S/C15H26O3/c1-11-6-5-9-13(10-11)15(18,14(16)17)12-7-3-2-4-8-12/h11-13,16,18H,2-10H2,1H3
charge 0 multiplicity 1
44 atoms
O  0.049474 -0.827603 1.941537
O  0.894288 -2.136911 -1.398068
O  0.894317 -3.068402 0.719144
C  -1.110356 -0.307629 -0.177904
C  0.258786 -0.694394 0.487609
C  1.393902 0.379091 0.304252
C  -1.624618 1.051732 0.356332
C  -2.178984 -1.408593 0.052064
C  -2.986456 1.454395 -0.267632
C  2.750199 -0.119772 0.868357
C  1.57832 0.932203 -1.131217
C  -3.539932 -1.02158 -0.572459
C  -4.036404 0.339854 -0.037518
C  3.807595 1.009259 0.854917
C  2.63704 2.063718 -1.149196
C  3.98979 1.592354 -0.566357
C  0.709988 -2.070732 -0.021982
C  -3.468838 2.813248 0.282605
H  -0.934215 -0.225441 -1.270061
H  1.066232 1.217067 0.954394
H  -0.890349 1.854476 0.151021
H  -1.7250 0.980957 1.457735
H  -2.300569 -1.560009 1.142579
H  -1.839949 -2.37355 -0.376117
H  -2.841231 1.555112 -1.366801
H  2.60407 -0.497729 1.89675
H  3.124131 -0.965864 0.252669
H  1.897092 0.116888 -1.808557
H  0.622775 1.323558 -1.527575
H  -4.285983 -1.812557 -0.362161
H  -3.436202 -0.96536 -1.676366
H  -4.993706 0.61712 -0.522106
H  -4.238122 0.256814 1.051376
H  4.772807 0.627885 1.241025
H  3.484418 1.817714 1.543224
H  2.264792 2.922629 -0.552311
H  2.773626 2.430386 -2.185312
H  4.712058 2.431635 -0.548022
H  4.419839 0.812137 -1.228381
H  -2.729991 3.613251 0.087058
H  -4.427076 3.115198 -0.180598
H  -3.624693 2.758904 1.377341
H  0.230806 -1.775344 2.190676
H  1.18103 -3.058419 -1.646063
