program: Gaussian 09
title: 000275008
version: EM64L-G09RevD.01
frameworkgroup: C1[X(C12H8O3)]
method: RPBEPBE
basis: SDD
operation: Freq
keyword: #pfreq=noraman
keyword: PBEPBE/SDD
title: #p freq=noraman PBEPBE/SDD
converged: YES YES NO NO
title: Mulliken charges:
elementType: O O O C C C C C C C C C C C C H H H H H H H H
charge: -0.194936 -0.223987 -0.190429 0.323759 0.023118 0.249237 0.015651 -0.319525 -0.358449 -0.316386 -0.237687 -0.225562 -0.221004 -0.265715 -0.146667 0.276154 0.275599 0.298630 0.234861 0.235040 0.234991 0.262775 0.270531
chargesum: 0.00000
title: Mulliken charges with hydrogens summed into heavy atoms:
elementType: O O O C C C C C C C C C C C C
charge: -0.194936 -0.223987 -0.190429 0.323759 0.023118 0.249237 0.015651 -0.043370 -0.082850 -0.017756 -0.002826 0.009478 0.013987 -0.002940 0.123864
polarizability: 2.27689496e+02 1.22996997e+01 1.32622372e+02 -4.06377995e+00 7.50711276e-01 6.58465442e+01
1716.lowfreq: 0.0003 0.0005 0.0006 2.5413 6.3633 13.3107 25.4667 41.0163 64.0891
frequency: 25.4649 40.9779 64.0819 126.8643 150.5209 163.6413 189.0064 268.9917 277.5402 355.5659 397.8534 414.5848 454.3659 497.9909 585.3224 612.1586 614.4286 647.2748 675.4654 691.7044 749.1601 765.1725 786.3190 827.6819 847.2359 858.3906 868.7277 881.9956 906.1093 951.2425 988.5855 993.2343 999.9991 1010.0864 1027.0256 1046.1883 1066.4726 1089.4100 1139.2282 1175.2381 1193.3248 1205.4578 1230.5002 1289.7596 1320.8409 1369.3265 1388.2637 1435.1920 1448.4212 1476.4494 1522.5293 1542.5390 1568.5820 1585.0050 1608.2566 3131.4930 3144.0981 3156.2487 3167.5793 3187.6852 3228.8232 3253.7132 3266.6428
redmass: 7.1505 4.2532 5.1229 6.6822 5.4741 5.9659 6.7930 7.1481 7.5565 9.3232 2.8593 5.2586 6.6770 5.6691 2.9126 6.4023 6.5913 7.0627 6.8496 1.8194 2.4727 1.2613 4.3916 3.0585 1.5602 1.2498 6.6970 4.6342 1.4001 1.4423 5.0832 1.4783 2.7572 1.3414 1.9324 2.4117 2.4098 1.5913 1.7722 1.0614 1.1365 1.6492 4.1037 6.1318 1.3446 2.6517 8.5842 2.3339 5.3147 2.2227 6.6715 10.2944 9.3076 6.4398 6.0507 1.0857 1.0892 1.0941 1.0992 1.0958 1.0918 1.0983 1.1095
irintensity: 4.9813 1.0546 1.2784 1.4603 0.6535 0.0660 1.4369 1.4092 19.9966 3.4970 0.1289 1.3621 3.0402 10.0823 10.6434 0.2393 2.7088 61.2917 19.5342 65.8709 35.9806 93.5068 93.9563 39.9387 6.2829 2.3696 12.3254 11.8764 2.1581 2.6609 0.6135 0.5562 31.8663 0.3638 5.1404 7.3774 72.4283 8.1485 8.3270 2.5103 44.8506 0.5879 187.1498 20.7533 2.9458 7.1137 7.1723 32.6843 93.9619 2.1745 22.0443 232.4333 206.0914 7.0495 25.1610 0.5125 9.8218 13.2041 28.4032 6.6623 1.7808 2.6399 0.5776
temp: 298.150 k
press: 1.00000 atm
elementType: 8 8 8 6 6 6 6 6 6 6 6 6 6 6 6 1 1 1 1 1 1 1 1
symmnumber: 1
zpe: 436350.1 jmol-1
zpe.correction: 0.166197 hartree
zpe.thermalcorrener: 0.178419 hartree
zpe.thermalcorrenthalpy: 0.179363 hartree
zpe.thermalcorrgfe: 0.125768 hartree
zpe.sumelectzpe: -686.672917 hartree
zpe.sumelectthermal: -686.660695 hartree
zpe.sumelectthermalent: -686.659751 hartree
zpe.sumelectthermalfe: -686.713346 hartree
dipole: 0.1764 0.9490 -2.6691
dipole: 2.8383
quadrupole: -53.9280 -87.3147 -89.7820
quadrupole: 3.0294 -2.8611 2.3314
quadrupole: 23.0802 -10.3065 -12.7737 3.0294 -2.8611 2.3314
hfenergy: -686.839114 hartree
pointgroup: C01 [X(C12H8O3)]
dipole: 0.0200607 0.8850891 0.6805656 debye
dipolederiv: -0.1776956 0.0106061 -0.0193603 0.0021048 -0.1109288 -0.0158921 -0.032088 -0.0174956 -0.5789005 -0.9168322 0.0852232 -0.0792576 0.2151704 -0.4500384 0.1894682 -0.3750401 0.2743596 -0.6245911 -0.8178114 -0.0670629 -0.0647347 -0.0288684 -0.3009024 -0.051119 -0.5396142 -0.1835504 -0.8041548 -0.9691565 0.1989838 -0.1932731 0.1519477 -0.0661077 0.0656153 -0.0713662 0.0584501 -0.0896025 1.7405345 -0.2466708 0.2581007 -0.3415996 0.3534781 -0.2406612 0.4044709 -0.331502 0.5165462 -0.826081 -0.1625508 -0.4263242 -0.1472451 -0.0294052 -0.0770269 -0.6380323 -0.1204986 -0.0399834 1.4914473 0.1999235 0.384181 0.2174891 0.2183147 0.1264763 0.7160547 0.2730568 0.8018091 0.1838273 0.0179067 -0.0764264 -0.1495258 -0.0537514 -0.0098218 0.1955183 -0.081428 -0.0033631 0.1668692 -0.1270727 0.1518942 0.0334123 -0.0543163 -0.0716078 -0.2108548 -0.0390661 -0.0322574 0.4445694 0.1096403 0.0440262 0.1461416 -0.0661711 -0.0056049 0.3264651 0.0612211 0.0321043 -0.3068226 -0.0483255 0.0869653 -0.0411372 -0.0645772 -0.1425473 0.1482041 -0.1497445 0.0641599 -0.0776903 0.1111746 -0.2082179 0.1574639 -0.1652932 -0.0070683 -0.2426808 -0.011375 -0.1001291 0.1427077 -0.0442935 0.0042164 -0.0726788 -0.0499203 -0.1009215 0.0460103 -0.0977693 0.0293567 -0.382478 -0.0178075 0.0698308 -0.0650154 -0.2176441 0.0061439 0.4045172 0.0705042 -0.007982 -0.0955662 0.0165096 -0.0022974 -0.012321 -0.0663012 0.0076247 -0.2538307 -0.0435332 0.3463178 0.1050117 -0.0303844 0.0731514 -0.0833266 0.128082 0.0113329 0.0653601 0.0495944 0.0829234 0.1346604 0.0324144 -0.0374604 0.0005803 0.1034282 0.0720235 0.0098337 0.0733986 0.0402011 0.1512901 -0.0239527 0.0616113 0.0195078 0.1787691 0.0291566 0.0805827 0.0011554 0.1089029 0.0659097 0.0268133 -0.02292 0.0389937 0.0777123 0.1194811 -0.0519091 0.1222332 -0.0241847 -0.0535266 -0.0315555 0.0852578 -0.0292151 0.1202994 0.0664455 0.1088549 0.064067 0.0396312 -0.1054541 0.0579266 -0.0417362 0.0549355 0.1230751 0.0374087 -0.0413581 0.0381069 0.1045628 0.0468932 -0.0342786 -0.0727071 -0.0322743 0.1909052 -0.0162015 -0.0822781 -0.0179819 0.0539339 0.0553939 -0.0331669 0.0254803 -0.0345397 0.2012935 0.0072956 0.0331803 0.0077972 0.0846993 unknown
polarizability: 224.8687921|0.5571567|72.534257|21.0226289|-20.1746157|128.7553633 unknown
InChI: InChI=1S/C12H8O3/c13-11(9-5-2-1-3-6-9)12(14)10-7-4-8-15-10/h1-8H
charge 0 multiplicity 1
23 atoms
O  3.29069 0.390822 -0.76804
O  -0.04206 -0.905964 1.594904
O  0.743932 -0.229218 -1.756144
C  -1.656807 0.046568 0.071222
C  -0.277459 -0.353071 0.476095
C  2.204721 0.151469 0.116518
C  0.907484 -0.129821 -0.501619
C  -1.939836 0.826024 -1.086421
C  -2.72718 -0.34637 0.926004
C  2.662938 0.272833 1.43514
C  -3.268872 1.200977 -1.3755
C  -4.050889 0.02455 0.628809
C  -4.325463 0.801207 -0.524608
C  4.061726 0.59191 1.377291
C  4.400678 0.654304 0.028822
H  -1.130953 1.122685 -1.757804
H  -2.489354 -0.940697 1.814551
H  2.053421 0.116825 2.321186
H  -3.481378 1.799971 -2.26739
H  -4.868545 -0.286062 1.288069
H  -5.356213 1.092059 -0.756853
H  4.733449 0.750598 2.218074
H  5.324972 0.860504 -0.504804
